{"text_format":"1","workbook":"xlsx","n_sheets":18,"sheets":["Caratula Resumen","A Y  II D3","A Y II D4","B)","II B) Y 1","II C y 1_","II D) 2","II D) 4","II D) 4 A","II D) 6","II D) 7 1","II D) 7 2 ","II D) 7 3","E)","F) 1","F) 2","G)","Listas"],"not_rendered":{"charts":0,"images":16,"macros":1,"external_links":0,"defined_names":17,"comments":16,"pivot_tables":0},"unopened":[],"bounds":{"document_bytes":16777216,"sheet_cells":100000,"rows_first":2000,"rows_last":500,"rows_between":2000,"halvings":0,"cell_chars":16384,"cell_head_chars":4096},"cells_cut":0,"cells_raw":0,"read":"whole","date_system":"1900"}

{"sheet":"Caratula Resumen","index":0,"n_rows":73,"n_cols":18,"rows_kept":73,"cut":false,"hidden":false,"merged":[[36,3,36,6],[10,3,10,18],[11,3,11,18],[12,3,12,18],[34,3,34,6],[35,3,35,6],[46,3,46,6],[47,3,47,6],[48,3,48,6],[37,3,37,6],[38,3,38,6],[39,3,39,6],[40,3,40,6],[41,3,41,6],[42,3,42,6],[69,2,69,5],[71,2,71,5],[72,2,72,5],[73,2,73,5],[20,3,20,14],[21,3,21,14],[22,3,22,14],[49,3,49,6],[62,2,62,5],[63,2,63,5],[65,2,65,5],[66,2,66,5],[68,2,68,5],[43,3,43,6],[44,3,44,6],[45,3,45,6]]}
[]
[]
[]
[]
[]
[]
[]
[]
[]
[]
[]
[null,null,null,"FORMATOS ENTREGADOS PARA DAR CUMPLIMIENTO AL ARTICULO 73 DE \"LA LEY GENERAL DE CONTABILIDAD GUBERNAMENTAL\""]
[]
[]
[]
[]
[]
[]
[]
[]
[null,null,"Entidad Federativa :"," SAN LUIS"]
[null,null,"Fondo :","Fondo de Aportaciones para la Educación Tecnológica y de Adultos/Colegio Nacional de Educación Profesional Técnica (FAETA/CONALEP)"]
[null,null,"Periodo :","3er. Trimestre"]
[]
[]
[]
[]
[]
[]
[]
[]
[null,null,null,null,null,null,null,"TOTAL REGISTROS ",null,"Num. de Paginas",null,"TOTAL PERSONAS",null,"TOTAL PLAZAS",null,"Total Pto. Federal",null,"Total Ppto. Otras Fuentes"]
[]
[]
[null,1,"A Y II D3","Personal Comisionado",null,null,null,"N/A",null,1,null,"N/A",null,"N/A",null,"N/A",null,"N/A"]
[null,2,"A Y II D4","Personal con Licencia",null,null,null,{"$f":"'A Y II D4'!C18","v":1},null,1,null,{"$f":"'A Y II D4'!C18","v":1},null,{"$f":"'A Y II D4'!M18","v":1},null,{"$f":"'A Y II D4'!P18","v":33574.462500000001},null,{"$f":"'A Y II D4'!Q20","v":0}]
[null,3,"B)   ","Registro Federal de Contribuyentes de Trabajadores con Pagos Retroactivos con un Periodo Mayor a 45 días",null,null,null,{"$f":"'B)'!C499","v":478},null,11,null,{"$f":"'B)'!C499","v":478},null,{"$f":"'B)'!L499","v":153},null,"N/A",null,"N/A"]
[null,4,"II B) Y 1","Plaza / Función",null,null,null,{"$f":"534","v":534},null,9,null,{"$f":"'II B) Y 1'!C556","v":530},null,"N/A",null,"N/A",null,"N/A"]
[null,5,"II C y 1_","Personal Federalizado por Registro Federal de Contribuyentes",null,null,null,{"$f":"'II C y 1_'!D188","v":170},null,4,null,{"$f":"'II C y 1_'!D188","v":170},null,{"$f":"'II C y 1_'!P188","v":165},null,{"$f":"'II C y 1_'!U188","v":9065412.6481000036},null,{"$f":"'II C y 1_'!V190","v":0}]
[null,6,"II D) 2","Movimientos de Plazas",null,null,null,{"$f":"'II D) 2'!C31","v":12},null,1,null,{"$f":"'II D) 2'!C31","v":12},null,{"$f":"'II D) 2'!M31","v":6},null,"N/A",null,"N/A"]
[null,7,"II D) 4","Trabajadores Jubilados en el Periodo",null,null,null,{"$f":"'II D) 4'!C18","v":1},null,1,null,{"$f":"'II D) 4'!C18","v":1},null,{"$f":"'II D) 4'!N18","v":1},null,"N/A",null,"N/A"]
[null,8,"II D) 4 A","Trabajadores que Tramitaron Licencia Prejubilatoria en el Periodo",null,null,null,"N/A",null,1,null,"N/A",null,"N/A",null,"N/A",null,"N/A"]
[null,9,"II D) 6","Trabajadores Contratados por Honorarios en el Periodo",null,null,null,null,null,null,null,null,null,"N/A",null,"N/A",null,"N/A"]
[null,10,"II D) 7 1 ","Analítico de Categorías / Plazas Autorizadas con su Tabulador",null,null,null,33,null,1,null,"N/A",null,"N/A",null,"N/A",null,"N/A"]
[null,11,"II D) 7 2 ","Catálogo de Categorías y Tabuladores",null,null,null,33,null,1,null,"N/A",null,"N/A",null,"N/A",null,"N/A"]
[null,12,"II D) 7 3 ","Catálogo de Percepciones y Deducciones",null,null,null,100,null,3,null,"N/A",null,"N/A",null,"N/A",null,"N/A"]
[null,13,"E)","Trabajadores que Cobran con RFC / CURP con Formato Incorreto",null,null,null,4,null,1,null,{"$f":"'E)'!C24","v":4},null,"N/A",null,"N/A",null,"N/A"]
[null,14,"F) 1","Trabajadores con Doble Asignación Salarial en Municipios no Colindantes Geográficamente",null,null,null,"N/A",null,1,null,"N/A",null,"N/A",null,"N/A",null,"N/A"]
[null,15,"F) 2","Trabajadores Ocupando Plazas que Superan el Número de Horas de Compatibilidad Autorizadas",null,null,null,"N/A",null,1,null,"N/A",null,"N/A",null,"N/A",null,"N/A"]
[null,16,"G)","Trabajadores Cuyo Salario Básico Supere los Ingresos Promedio de un Docente en la Categoría más Alta del Tabulador Salarial Correspondiente a Cada Entidad",null,null,null,"N/A",null,1,null,"N/A",null,"N/A",null,"N/A",null,"N/A"]
[]
[]
[]
[]
[]
[]
[]
[]
[]
[]
[]
[]
[null,null,"Lic. Claudia Ivonne Ramos Gutiérrez"]
[null,null,"Nombre del  Responsable"]
[]
[null,null,"Subdirectora de Administración"]
[null,null,"Cargo"]
[]
[]
[null,null,"Firma"]
[]
[null,null,"10 de Octrubre del 2013"]
[null,null,"Fecha"]

{"sheet":"A Y  II D3","index":1,"n_rows":23,"n_cols":25,"rows_kept":23,"cut":false,"hidden":false,"merged":[[19,12,19,14],[12,24,13,24],[12,13,12,14],[12,15,13,15],[12,16,13,16],[12,17,13,17],[12,18,12,19],[12,20,13,20],[17,13,17,14],[12,21,13,21],[12,22,13,22],[12,23,13,23],[9,1,9,7],[12,6,12,12],[12,1,13,1],[12,2,13,2],[12,3,13,3],[12,4,13,4],[12,5,13,5]]}
[]
[]
[]
[]
[]
[]
[]
[]
[null,"Formato: Personal Comisionado"]
[null,{"$f":"IF('Caratula Resumen'!D22=\"Elige el Periodo…\",\"\",'Caratula Resumen'!D22)","v":"Fondo de Aportaciones para la Educación Tecnológica y de Adultos/Colegio Nacional de Educación Profesional Técnica (FAETA/CONALEP)"},null,null,null,null,null,null,null,null,null,null,null,null,null,null,null,null,null,null,null,null,null,{"$f":"IF('Caratula Resumen'!D23=\"Elige el Periodo…\",\"\",'Caratula Resumen'!D23)","v":"3er. Trimestre"}]
[]
[]
[null,"Entidad Federativa","R.F.C.","CURP","Nombre","Clave integrada","Clave Presupuestal",null,null,null,null,null,null,"Fecha Comisión",null,"Percepciones pagadas en el Periodo de Comisión con Presupuesto Federal*","Percepciones pagadas en el Periodo de Comisión con Presupuesto de otra fuente*","Clave CT Origen","CT Destino dentro del sector",null,"Lugar de la comisión fuera del sector educativo","Tipo de Comisión","Función Específica","Objeto de la comision","No. Oficio"]
[null,null,null,null,null,null,"Partida Presupuestal","Código de Pago","Clave de Unidad","Clave de Sub Unidad","Clave de Categoría","Horas Semana Mes ","Número de Plaza","Inicio","Conclusión",null,null,null,"Clave","Turno"]
[]
[null,"Entidad Federativa","R.F.C.","CURP","Nombre","Clave integrada","Partida Presupuestal","Código de Pago","Clave de Unidad","Clave de Sub Unidad","Clave de Categoría","Horas Semana Mes ","Número de Plaza","Fecha Comisión\nInicio","Fecha Comisión\nConclusión","Percepciones pagadas en el Periodo de Comisión con Presupuesto Federal*","Percepciones pagadas en el Periodo de Comisión con Presupuesto de otra fuente*","Clave CT Origen","Clave","Turno","Lugar de la comisión fuera del sector educativo","Tipo de Comisión","Función Específica","Objeto de la comision","No. Oficio"]
[null,null,null,null,null,null,null,null,null,null,null,null,null,null,null,null,null,null,null,null,null,"12","COMISIÓN SINDICAL","DELEGADA ESTATAL SUTCONALEP","D.P./980/2013"]
[null,"Total Personas : ",null,null,null,null,null,null,null,null,"Total Plazas : ",null,null,"Total Pto. Federal"]
[]
[null,"NO APLICA PARA ESTE ORGANISMO PARA EL TERCER TRIMESTRE DEL 2013",null,null,null,null,null,null,null,null,null,null,"Total Ppto. Otras Fuentes"]
[]
[null,"*Total de Percepciones reportadas por la Entidad Federativa como pagadas al trabajador durante la comisión."]
[null,"Fuente : Información proporcionada por las Entidades Federativas."]

{"sheet":"A Y II D4","index":2,"n_rows":23,"n_cols":21,"rows_kept":23,"cut":false,"hidden":false,"merged":[[9,1,9,6],[17,13,17,14],[12,16,13,16],[12,17,13,17],[12,20,13,20],[12,1,13,1],[12,3,13,3],[12,4,13,4],[12,5,13,5],[12,6,12,12],[12,13,12,14],[12,2,13,2],[12,18,12,19],[12,15,13,15]]}
[]
[]
[]
[]
[]
[]
[]
[]
[null,"Formato: Personal con Licencia"]
[null,{"$f":"IF('Caratula Resumen'!D22=\"Elige el Periodo…\",\"\",'Caratula Resumen'!D22)","v":"Fondo de Aportaciones para la Educación Tecnológica y de Adultos/Colegio Nacional de Educación Profesional Técnica (FAETA/CONALEP)"},null,null,null,null,null,null,null,null,null,null,null,null,null,null,null,null,null,null,{"$f":"IF('Caratula Resumen'!D23=\"Elige el Periodo…\",\"\",'Caratula Resumen'!D23)","v":"3er. Trimestre"}]
[]
[]
[null,"Entidad Federativa","R.F.C.","CURP","NOMBRE","Clave integrada","Clave Presupuestal",null,null,null,null,null,null,"Periodo Licencia",null,"Percepciones pagadas en el Periodo de la Licencia con Presupuesto Federal*","Percepciones pagadas en el Periodo de la Licencia con Presupuesto de otra fuente*","Clave CT Origen","Licencia",null,"Descripción de la Licencia"]
[null,null,null,null,null,null,"Partida Presupuestal","Código de Pago","Clave de Unidad","Clave de Sub Unidad","Clave de Categoría","Horas Semana Mes ","Número de Plaza","Inicio","Conclusión",null,null,null,"Clave","Tipo"]
[]
[null,"Entidad Federativa","R.F.C.","CURP","NOMBRE","Clave integrada","Partida Presupuestal","Código de Pago","Clave de Unidad","Clave de Sub Unidad","Clave de Categoría","Horas Semana Mes ","Número de Plaza","Periodo Licencia\nInicio","Periodo Licencia\nConclusión","Percepciones pagadas en el Periodo de la Licencia con Presupuesto Federal*","Percepciones pagadas en el Periodo de la Licencia con Presupuesto de otra fuente*","Clave CT Origen","Licencia\nClave","Licencia\nTipo","Descripción de la Licencia"]
[null,"SAN LUIS PÓTOSI","RORR811129MR5","RORR811129MSPCDC01","ROCÍO ROCHA RODRÍGUEZ","11311003532CF0420108139",1131,"00000",24,3,"CF04201",0,8139,20130701,20130930,33574.462500000001,0,"24DPT0009M",12,"GOCE","COMISION SINDICAL"]
[null,"Total Personas : ",1,null,null,null,null,null,null,null,"Total Plazas : ",null,1,"Total Pto. Federal",null,{"$f":"Tabla3[Percepciones pagadas en el Periodo de la Licencia con Presupuesto Federal*]","v":33574.462500000001}]
[]
[null,null,null,null,null,null,null,null,null,null,null,null,null,"Total Ppto. Otras Fuentes",null,null,{"$f":"Tabla3[Percepciones pagadas en el Periodo de la Licencia con Presupuesto de otra fuente*]","v":0}]
[]
[null,"*Total de Percepciones reportadas por la Entidad Federativa como pagadas al trabajador durante la Licencia."]
[null,"Fuente : Información proporcionada por las Entidades Federativas."]

{"sheet":"B)","index":3,"n_rows":507,"n_cols":19,"rows_kept":507,"cut":false,"hidden":false,"merged":[[503,1,504,10],[499,1,502,10],[12,18,13,18],[12,12,13,12],[12,13,13,13],[12,14,13,14],[12,15,12,16],[12,17,13,17],[9,1,9,10],[12,1,13,1],[12,2,13,2],[12,3,13,3],[12,4,13,4],[12,5,12,11]]}
[]
[]
[]
[]
[]
[]
[]
[]
[null,"Formato: Registro Federal de Contribuyentes de Trabajadores con Pagos Retroactivos con un Periodo Mayor a 45 días"]
[null,{"$f":"IF('Caratula Resumen'!D22=\"Elige el Periodo…\",\"\",'Caratula Resumen'!D22)","v":"Fondo de Aportaciones para la Educación Tecnológica y de Adultos/Colegio Nacional de Educación Profesional Técnica (FAETA/CONALEP)"},null,null,null,null,null,null,null,null,null,null,null,null,null,null,null,{"$f":"IF('Caratula Resumen'!D23=\"Elige el Periodo…\",\"\",'Caratula Resumen'!D23)","v":"3er. Trimestre"}]
[]
[]
[null,"Entidad Federativa","RFC","CURP","Nombre","Clave Presupuestal",null,null,null,null,null,null,"Clave de Centro de Trabajo","Fecha de emisión de pago","Motivo del Pago Retroactivo","Periodo pagado",null,"Días transcurridos para el pago","Percepciones pagadas en el periodo reportado *"]
[null,null,null,null,null,"Partida Presupuestal","Código de Pago","Clave de Unidad","Clave de Sub Unidad","Clave de Categoría","Horas Semana Mes ","Número de Plaza",null,null,null,"Desde","Hasta"]
[]
[null,"Entidad Federativa","RFC","CURP","Nombre","Partida Presupuestal","Código de Pago","Clave de Unidad","Clave de Sub Unidad","Clave de Categoría","Horas semana mes","Número de plaza","Clave de Centro de Trabajo","Fecha de emisión de pago","Motivo del Pago Retroactivo","Periodo pagado\nDesde","Periodo pagado\nHasta","Días transcurridos para el pago","Percepciones pagadas en el periodo reportado *"]
[null,"SAN LUIS POTOSI","AADJ710417P70","AADJ710417HSPLZM09","JAIME ALVAREZ DIAZ","01131","1003","53","2","CF33204","00.0",5096,"24DPT0007O",201315,"9",201303,201315,195,5928.9800000000005]
[null,"SAN LUIS POTOSI","AAEV820708KG1","AAEV820708MSPLSN04","VIANEY ALVAREZ ESTRADA","01131","1003","53","2","CF33204","00.0",9247,"24DPT0003S",201315,"9",201303,201315,195,5436.4000000000005]
[null,"SAN LUIS POTOSI","AAHR590313BP3","AAHR590313HSPLRM03","RAMIRO ALVARADO HERRERA","01131","1003","53","2","CF33204","00.0",5089,"24DPT0003S",201315,"9",201303,201315,195,6946.52]
[null,"SAN LUIS POTOSI","AAMR760716SI1","AAMR760716MSPRLC06","ROCIO DEL CARMEN ARAUJO MELENDEZ","01131","1003","53","2","CF33206","00.0",11186,"24DPT0009X",201315,"9",201303,201315,195,7882.4900000000007]
[null,"SAN LUIS POTOSI","AARG670120NU4","AARG670120MSPLYD07","MA. GUADALUPE ALMAZAN REYES","01131","1003","53","2","CF33204","00.0",6806,"24DPT0001U",201315,"9",201303,201315,195,5927.84]
[null,"SAN LUIS POTOSI","AELR680504JA6","AELR680504HSPLRM09","RAMIRO ALMENDARIZ LOREDO","01131","1003","53","2","CF33204","00.0",9238,"24DPT0009M",201315,"9",201303,201315,195,6288.21]
[null,"SAN LUIS POTOSI","AEMJ710318GR8","AEMJ710318MSPRRS05","JOSEFINA ARREDONDO MORENO","01131","1003","53","2","CF33204","00.0",5097,"24DPT0003S",201315,"9",201303,201315,195,5779]
[null,"SAN LUIS POTOSI","AOAM760119SL9","AOAM760119MDFLRR09","MARIANA ALONSO ARROYO","01131","1003","53","2","CF33204","00.0",8155,"24DPT0005Q",201315,"9",201303,201315,195,4688.7700000000004]
[null,"SAN LUIS POTOSI","AOCM540706DF7","AOCM540706HSPLVG04","MIGUEL AGUSTIN ALONSO CUEVAS","01131","1003","53","2","CF21202","00.0",12113,"24DPT0005Q",201315,"9",201303,201315,195,4337.6000000000004]
[null,"SAN LUIS POTOSI","BAAJ5701089W8","BAAJ570108HSPNNN02","JUAN FELIPE BANDA ANGUIANO","01131","1003","53","2","CF18203","00.0",8159,"24DPT0007O",201315,"9",201303,201315,195,3962.3500000000004]
[null,"SAN LUIS POTOSI","BABD811223FSA","BABD811223MSPZNL05","MARIA DOLORES BAEZ BANDA","01131","1003","53","2","CF21202","00.0",3265,"24DPT0005Q",201315,"9",201303,201315,195,3596.67]
[null,"SAN LUIS POTOSI","BARG670418KM6","BARG670418MSPZMD01","MARIA GUADALUPE BAEZ RAMIREZ","01131","1003","53","2","CF33204","00.0",3272,"24DPT0005Q",201315,"9",201303,201315,195,6361.33]
[null,"SAN LUIS POTOSI","BEOC791213PUG","BEOC791213HMCLRR05","CRHISTIAN ARTURO BELTRAN ORTEGA","01131","1003","53","2","A01801","00.0",32002,"24DPT0005Q",201315,"9",201303,201315,195,4112.4400000000005]
[null,"SAN LUIS POTOSI","CADR541024LK1","CADR541024MSPSZS05","MA. DEL ROSARIO CASTILLO DIAZ","01131","1003","53","2","T08201","00.0",11307,"24DPT0001U",201315,"9",201303,201315,195,4232.1100000000006]
[null,"SAN LUIS POTOSI","CAMF701124TC7","CAMF701124HSPBDR12","FERNANDO CABRIALES MEDELLIN","01131","1003","53","2","CF33206","00.0",13799,"24DPT0005Q",201315,"9",201303,201315,195,8576.01]
[null,"SAN LUIS POTOSI","CAMM550517IH3","CAMM550517HSPSRR03","MAURICIO CASTILLO MORALES","01131","1003","53","2","A03202","00.0",3298,"24DPT0001U",201315,"9",201303,201315,195,3936.55]
[null,"SAN LUIS POTOSI","CAPE7205048Y3","CAPE720504HSPHZR05","ERNESTO CHAVEZ POZOS","01131","1003","53","2","CF19201","00.0",3308,"24DPT0001U",201315,"9",201303,201315,195,3620.21]
[null,"SAN LUIS POTOSI","CARF660330CX6","CARF660330HSPMVL00","FELIPE DE JESUS CAMACHO RIVERA","01131","1003","53","2","CF21202","00.0",9274,"24DPT0009M",201315,"9",201303,201315,195,3793.4300000000003]
[null,"SAN LUIS POTOSI","CASE760707JF9","CASE760707MSPLFL01","ELVIA ESTHER CALDERON SAFA","01131","1003","53","2","CF33206","00.0",11178,"24DPT0009X",201315,"9",201303,201315,195,8058.4400000000005]
[null,"SAN LUIS POTOSI","CAVA5107243K4","CAVA510724HSPHRN05","JOSE A CHAVEZ VARGAS","01131","1003","53","2","CF33206","00.0",13128,"24DPT0005Q",201315,"9",201303,201315,195,10144.540000000001]
[null,"SAN LUIS POTOSI","COMF5002232B2","COMF500223HDFLRL06","FELIPE COLLES MURGA","01131","1003","53","2","CF33206","00.0",13129,"24DPT0005Q",201315,"9",201303,201315,195,7911.39]
[null,"SAN LUIS POTOSI","DEGV660220PV1","DEGV660220MSPLNR02","VIRGINIA DELGADO GONZALEZ","01131","1003","53","2","CF33206","00.0",13854,"24DPT0001U",201315,"9",201303,201315,195,9473.27]
[null,"SAN LUIS POTOSI","DICA6803126P0","DICA680312MSPZNN03","MARIA ANITA DIAZ CONTRERAS","01131","1003","53","2","A03202","00.0",3240,"24DPT0005Q",201315,"9",201303,201315,195,3884.79]
[null,"SAN LUIS POTOSI","DIDG730222874","DIDG730222MTSZSB06","GABRIELA DIAZ DIOSDADO","01131","1003","53","2","CF33206","00.0",13130,"24DPT0005Q",201315,"9",201303,201315,195,11078.720000000001]
[null,"SAN LUIS POTOSI","DIRA831017RWA","DIRA831017HSPZML00","ALEJANDRO DIAZ RAMIREZ","01131","1003","53","2","S01201","00.0",3296,"24DPT0001U",201315,"9",201303,201315,195,2651.33]
[null,"SAN LUIS POTOSI","GAAF571004N86","GAAF571004HSPRRR07","FRANCISCO JAVIER GARCIA AREVALO","01131","1003","53","2","A03202","00.0",9245,"24DPT0009M",201315,"9",201303,201315,195,3941.51]
[null,"SAN LUIS POTOSI","GACA8606041K6","GACA860604HSPRSD08","ADRIAN GARCIA CASTILLO","01131","1003","53","2","S01201","00.0","3281","24DPT0005Q",201315,"9",201303,201315,195,75.5]
[null,"SAN LUIS POTOSI","GAMV520122GS8","GAMV520122HSPRRC02","VICENTE GARCIA MORENO","01131","1003","53","2","A03202","00.0",9239,"24DPT0009M",201315,"9",201303,201315,195,4034.98]
[null,"SAN LUIS POTOSI","GARF5708239A8","GARF570823HSPLML02","JOSE FELIPE GALVAN RAMIREZ","01131","1003","53","2","CF33204","00.0",9242,"24DPT0009M",201315,"9",201303,201315,195,6653.8]
[null,"SAN LUIS POTOSI","GAVR610904NB5","GAVR610904HSPYLN05","JOSE RENE GAYTAN VELAZQUEZ","01131","1003","53","2","CF33206","00.0",9247,"24DPT0007O",201315,"9",201303,201315,195,8391.0500000000011]
[null,"SAN LUIS POTOSI","GOFO750504S66","GOFO750504MSPNZR00","ORYANA VANESSA GONZALEZ FAZ","01131","1003","53","2","CF33206","00.0",13132,"24DPT0005Q",201315,"9",201303,201315,195,8587.82]
[null,"SAN LUIS POTOSI","GOLC801206QJ7","GOLC801206MSPNNL06","CLAUDIA MORENA GONZALEZ DE LEON","01131","1003","53","2","A03202","00.0",3297,"24DPT0001U",201315,"9",201303,201315,195,3285.06]
[null,"SAN LUIS POTOSI","GOME590117GA8","GOME590117HTSVCN07","ENRIQUE RAFAEL GOVEA MOCTEZUMA","01131","1003","53","2","CF33206","00.0",14528,"24DPT0009M",201315,"9",201303,201315,195,9630.36]
[null,"SAN LUIS POTOSI","GOMS6204091U8","GOMS620409MSPNNL00","SILVIA MARGARITA GONZALEZ MONJARAS","01131","1003","53","2","CF33206","00.0",13798,"24DPT0005Q",201315,"9",201303,201315,195,7177.1500000000005]
[null,"SAN LUIS POTOSI","GOZE620303R12","GOZE620303HSPLVV07","EVERARDO GLORIA ZAVALA","01131","1003","53","2","CF18203","00.0",3253,"24DPT0005Q",201315,"9",201303,201315,195,4237.96]
[null,"SAN LUIS POTOSI","GUDE5903131Y1","GUDE590313MSPRZL08","MA. ELVIA GUERRERO DIAZ","01131","1003","53","2","S01202","00.0",8151,"24DPT0007O",201315,"9",201303,201315,195,3606.8500000000004]
[null,"SAN LUIS POTOSI","GUDJ5907187J8","GUDJ590718HTSRZS05","JESUS SALVADOR GUERRA DIAZ","01131","1003","53","2","CF19201","00.0",8146,"24DPT0007O",201315,"9",201303,201315,195,4173.5600000000004]
[null,"SAN LUIS POTOSI","GUHM580226452","GUHM580226MSPTRR02","MARTHA DE LA CRUZ GUTIERREZ HERNANDEZ","01131","1003","53","2","CF33204","00.0",3260,"24DPT0005Q",201315,"9",201303,201315,195,6572.77]
[null,"SAN LUIS POTOSI","GUPS4410229S8","GUPS441022HSPJNL01","SALOMON FRANCISCO GUAJARDO PUENTE","01131","1003","53","2","S01201","00.0",3261,"24DPT0005Q",201315,"9",201303,201315,195,3828.44]
[null,"SAN LUIS POTOSI","GURJ750624QQ8","GURJ750624MSPTMN05","JUANA GUTIERREZ RAMIREZ","01131","1003","53","2","ED01201","00.0",5627,"24DPT0001U",201315,"9",201303,201315,195,3881.63]
[null,"SAN LUIS POTOSI","HEAL670226MP7","HEAL670226MSPRCT07","LETICIA HERNANDEZ ACOSTA","01131","1003","53","2","CF34201","00.0",3273,"24DPT0005Q",201315,"9",201303,201315,195,4163.87]
[null,"SAN LUIS POTOSI","HEHL8111128I5","HEHL811112HSPRRS09","JOSE LUIS HERNANDEZ HERNANDEZ","01131","1003","53","2","CF04201","00.0",11924,"24DPT0001U",201315,"9",201303,201315,195,3549.38]
[null,"SAN LUIS POTOSI","HEHP770124UI6","HEHP770124HSPRRD02","PEDRO HERNANDEZ HERNANDEZ","01131","1003","53","2","S01202","00.0",3283,"24DPT0005Q",201315,"9",201303,201315,195,3481.4100000000003]
[null,"SAN LUIS POTOSI","HEJV7203106N5","HEJV720310HSPRRC02","VICENTE HERRERA JUAREZ","01131","1003","53","2","S01202","00.0",3309,"24DPT0001U",201315,"9",201303,201315,195,3067.55]
[null,"SAN LUIS POTOSI","HENC630117DV8","HENC630117MSPRVN09","MA. CONCEPCION HERNANDEZ NAVA","01131","1003","53","2","CF33206","00.0",14531,"24DPT0001U",201315,"9",201303,201315,195,9292.15]
[null,"SAN LUIS POTOSI","HUEE8802101U6","HUEE880210MSPRSS07","ESMERALDA HUERTA ESPINO","01131","1003","53","2","CF34202","00.0","12054","24DPT0001U",201315,"9",201303,201315,195,75.5]
[null,"SAN LUIS POTOSI","HUGE570105RR1","HUGE570105HSPRNM01","EMILIANO HUERTA GONZALEZ","01131","1003","53","2","S01202","00.0",3304,"24DPT0001U",201315,"9",201303,201315,195,3729.53]
[null,"SAN LUIS POTOSI","IAGR490127IV9","IAGR490127HSPBLF04","JOSE REFUGIO IBARRA GALLEGOS","01131","1003","53","2","S01202","00.0",3264,"24DPT0005Q",201315,"9",201303,201315,195,4030.0400000000004]
[null,"SAN LUIS POTOSI","IOGM6306269A8","IOGM630626HSPVMR05","JOSE MARTIN IVON GOMEZ","01131","1003","53","2","S01202","00.0",8149,"24DPT0007O",201315,"9",201303,201315,195,3161.1800000000003]
[null,"SAN LUIS POTOSI","JADV701114SJ4","JADV701114MSPSZR05","VERONICA JASSO DIAZ","01131","1003","53","2","CF33204","00.0",3284,"24DPT0009X",201315,"9",201303,201315,195,6613.77]
[null,"SAN LUIS POTOSI","JAGT620724585","JAGT620724MSPMMR02","TERESA JAIME GOMEZ","01131","1003","53","2","CF19201","00.0",8160,"24DPT0007O",201315,"9",201303,201315,195,3910.73]
[null,"SAN LUIS POTOSI","JUBM570114M1A","JUBM570114MMNRRC01","MACRINA JUAREZ BARRIGA","01131","1003","53","2","A01801","00.0",32001,"24DPT0005Q",201315,"9",201303,201315,195,4190.5700000000006]
[null,"SAN LUIS POTOSI","LARA6807312Z9","LARA680731MSPLDN09","ANA MARIA LLAMAS RODRIGUEZ","01131","1003","53","2","S01202","00.0",9253,"24DPT0009M",201315,"9",201303,201315,195,3703.23]
[null,"SAN LUIS POTOSI","LEGS740525K51","LEGS740525HSPLNR07","SERGIO LEAL GONZALEZ","01131","1003","53","2","CF33206","00.0",13857,"24DPT0001U",201315,"9",201303,201315,195,8551.130000000001]
[null,"SAN LUIS POTOSI","LELJ610303BE8","LELJ610303MSPJPN03","JUANA LEIJA LOPEZ","01131","1003","53","2","S01201","00.0",8149,"24DPT0009M",201315,"9",201303,201315,195,2473.27]
[null,"SAN LUIS POTOSI","LEMM840920N55","LEMM840920HSPYDR03","MARCO ANTONIO M. LEYVA MEDINA","01131","1003","53","2","CF33204","00.0",6794,"24DPT0009X",201315,"9",201303,201315,195,5070.6500000000005]
[null,"SAN LUIS POTOSI","LOCJ580721MFC","LOCJ580721HSPMSN00","JUAN IGNACIO LOMELI CASTRO","01131","1003","53","2","CF33206","00.0",14040,"24DPT0007O",201315,"9",201303,201315,195,8487.52]
[null,"SAN LUIS POTOSI","LOEJ490328FF6","LOEJ490328HSPPSM03","JOSE JAIME LOPEZ ESCALANTE","01131","1003","53","2","S01202","00.0",3268,"24DPT0005Q",201315,"9",201303,201315,195,3862.5800000000004]
[null,"SAN LUIS POTOSI","LOEL560228TP6","LOEL560228HSPPSS08","JOSE LUIS LOPEZ ESPERICUETA","01131","1003","53","2","S01202","00.0",9251,"24DPT0009M",201315,"9",201303,201315,195,3832.57]
[null,"SAN LUIS POTOSI","LOFY8312272NS","LOFY831227MSPPZS08","YOSHELYN ESTHER LOPEZ FAZ","01131","1003","53","2","S01201","00.0",9256,"24DPT0009M",201315,"9",201303,201315,195,3166.07]
[null,"SAN LUIS POTOSI","LOHE7609184N6","LOHE760918MGTNRL00","ELSA LONGORIA HERNANDEZ","01131","1003","53","2","CF33206","00.0",11187,"24DPT0009X",201315,"9",201303,201315,195,8400.0500000000011]
[null,"SAN LUIS POTOSI","LOIJ9006248S2","LOIJ900624HSPPBN08","JUAN ANTONIO LOPEZ IBARRA","01131","1003","53","2","S01201","00.0",3270,"24DPT0005Q",201315,"9",201303,201315,195,2892.03]
[null,"SAN LUIS POTOSI","LOMC710712LGA","LOMC710712MSPRDN03","MA. CONSUELO LOREDO MEDINA","01131","1003","53","2","A03202","00.0",3295,"24DPT0005Q",201315,"9",201303,201315,195,3840.4100000000003]
[null,"SAN LUIS POTOSI","LUMF5609182L7","LUMF560918HSPNRR03","FRANCISCO LUNA MORA","01131","1003","53","2","S01201","00.0",11642,"24DPT0009M",201315,"9",201303,201315,195,3073.8900000000003]
[null,"SAN LUIS POTOSI","LUMO660710AW4","LUMO660710MSPNRF02","OFELIA LUNA MORA","01131","1003","53","2","S01202","00.0",9257,"24DPT0009M",201315,"9",201303,201315,195,3664.88]
[null,"SAN LUIS POTOSI","MACE730306K53","MACE730306MSPNDL03","ELDA GUADALUPE MANZANARES CEDILLO","01131","1003","53","2","CF33206","00.0",13945,"24DPT0003S",201315,"9",201303,201315,195,8789.68]
[null,"SAN LUIS POTOSI","MADV800530Q43","MADV800530MSPRLR06","VERONICA IVETTE MARTINEZ DELGADO","01131","1003","53","2","CF33203","00.0",5109,"24DPT0003S",201315,"9",201303,201315,195,3916.7200000000003]
[null,"SAN LUIS POTOSI","MAEK7710123X3","MAEK771012MSPCLR08","KAREN MACIAS VALADEZ ELIAS","01131","1003","53","2","CF33206","00.0",13131,"24DPT0009X",201315,"9",201303,201315,195,8323.6400000000012]
[null,"SAN LUIS POTOSI","MAGA3904151C1","MAGA390415HSPRRN04","ANASTACIO MARTINEZ GARCIA","01131","1003","53","2","S01202","00.0",5112,"24DPT0003S",201315,"9",201303,201315,195,4065.69]
[null,"SAN LUIS POTOSI","MAGJ890820CJ8","MAGJ890820HSPTNN00","JONATHAN MATA GONZALEZ","01131","1003","53","2","S01201","00.0",3268,"24DPT0005Q",201315,"9",201303,201315,195,2473.27]
[null,"SAN LUIS POTOSI","MAGM710703LS8","MAGM710703MSPRTR04","MARILU MARTINEZ GUTIERREZ","01131","1003","53","2","CF33206","00.0",14042,"24DPT0009M",201315,"9",201303,201315,195,8058.9500000000007]
[null,"SAN LUIS POTOSI","MAIG680708QS5","MAIG680708HSPRBL07","GILBERTO MARTINEZ IBARRA","01131","1003","53","2","CF34201","00.0",5094,"24DPT0003S",201315,"9",201303,201315,195,3892.1200000000003]
[null,"SAN LUIS POTOSI","MAMJ560724770","MAMJ560724HSPRRN00","JUAN MANUEL MARTINEZ MARTINEZ","01131","1003","53","2","CF33204","00.0",5101,"24DPT0003S",201315,"9",201303,201315,195,6535.9400000000005]
[null,"SAN LUIS POTOSI","MAML661226UW5","MAML661226MSPRLR04","LAURA ELISA MARTINEZ MELENDEZ","01131","1003","53","2","CF33202","00.0",3274,"24DPT0005Q",201315,"9",201303,201315,195,4559.8]
[null,"SAN LUIS POTOSI","MAMR710125SH6","MAMR710125MMCDNB03","RUBI GUADALUPE MADRIGAL MENDEZ","01131","1003","53","2","CF33206","00.0",13801,"24DPT0009M",201315,"9",201303,201315,195,8976.1]
[null,"SAN LUIS POTOSI","MAOR6107121R7","MAOR610712HSPRRN06","RENE MARTINEZ ORTIGOZA","01131","1003","53","2","CF33204","00.0",9266,"24DPT0005Q",201315,"9",201303,201315,195,9083.65]
[null,"SAN LUIS POTOSI","MAPD470328R25","MAPD470328HSPRRL01","J.DOLORES MARTINEZ PEREZ","01131","1003","53","2","S01201","00.0",8147,"24DPT0007O",201315,"9",201303,201315,195,3671.84]
[null,"SAN LUIS POTOSI","MARM6009139V5","MARM600913MSPTYR07","MARGARITA MATA REYES","01131","1003","53","2","CF04201","00.0",3242,"24DPT0005Q",201315,"9",201303,201315,195,3843.1200000000003]
[null,"SAN LUIS POTOSI","MATG660909AX2","MATG660909MSPRRD06","MA.GUADALUPE MARTINEZ TERAN","01131","1003","53","2","CF33204","00.0",9258,"24DPT0009M",201315,"9",201303,201315,195,6440.0700000000006]
[null,"SAN LUIS POTOSI","MATM681225M69","MATM681225MSPRRN01","MANUELA MARTINEZ TERAN","01131","1003","53","2","CF33206","00.0",9283,"24DPT0009X",201315,"9",201303,201315,195,7665.67]
[null,"SAN LUIS POTOSI","MAVJ811117IY1","MAVJ811117MSPRLN08","JUANA ISABEL MARTINEZ VELAZQUEZ","01131","1003","53","2","S01201","00.0",8150,"24DPT0007O",201315,"9",201303,201315,195,2704.38]
[null,"SAN LUIS POTOSI","MEBL691213A88","MEBL691213HSPJRS04","LUIS MANUEL MEJORADO BARRAGAN","01131","1003","53","2","S01202","00.0",5114,"24DPT0003S",201315,"9",201303,201315,195,3511.81]
[null,"SAN LUIS POTOSI","MEBR7304207S1","MEBR730420HSPJRY02","REYNALDO MEJORADO BARRAGAN","01131","1003","53","2","S01201","00.0",5110,"24DPT0003S",201315,"9",201303,201315,195,1866.21]
[null,"SAN LUIS POTOSI","MECA5608025R7","MECA560802MSPDHN03","MARIA ANGELICA MEDRANO CHAVEZ","01131","1003","53","2","CF18203","00.0",5107,"24DPT0003S",201315,"9",201303,201315,195,4375.95]
[null,"SAN LUIS POTOSI","MEES680705HB4","MEES680705MNLNSR09","SARA MENDOZA ESPINOSA","01131","1003","53","2","CF33204","00.0",5379,"24DPT0009X",201315,"9",201303,201315,195,6434.4400000000005]
[null,"SAN LUIS POTOSI","MEJR550324RF2","MEJR550324MSPLSS05","MARIA DEL ROSARIO MELENDEZ JASSO","01131","1003","53","2","S01201","00.0",9260,"24DPT0009M",201315,"9",201303,201315,195,3480.67]
[null,"SAN LUIS POTOSI","MEOP540116RN1","MEOP540116HSPXLR06","PORFIRIO MEXICANO OLIVA","01131","1003","53","2","CF21202","00.0",8150,"24DPT0007O",201315,"9",201303,201315,195,4076.7200000000003]
[null,"SAN LUIS POTOSI","MIEM640812V46","MIEM640812MCLJSR01","MARTHA FABIANA MIJARES ESPINOZA","01131","1003","53","2","CF33204","00.0",8152,"24DPT0003S",201315,"9",201303,201315,195,6241.18]
[null,"SAN LUIS POTOSI","MIFJ490102E61","MIFJ490102MSPRRS07","MA. DE JESUS MIRELES FORTANELLI","01131","1003","53","2","A03202","00.0",9236,"24DPT0009M",201315,"9",201303,201315,195,3853.4]
[null,"SAN LUIS POTOSI","MOAL660825G18","MOXA660825HSPRXL06","ALFREDO MORENO .","01131","1003","53","2","S01202","00.0",9262,"24DPT0009M",201315,"9",201303,201315,195,3900.1800000000003]
[null,"SAN LUIS POTOSI","MOBO7207294K1","MOBO720729MSPRDF04","OFELIA MORALES BADILLO","01131","1003","53","2","T08201","00.0",9261,"24DPT0009M",201315,"9",201303,201315,195,4273.13]
[null,"SAN LUIS POTOSI","MOGB710304G33","MOGB710304HSPRLN00","BENJAMIN OMAR MORALES GUILLEN","01131","1003","53","2","CF34202","00.0",12054,"24DPT0001U",201315,"9",201303,201315,195,3284.7400000000002]
[null,"SAN LUIS POTOSI","MORL810527AT0","MORL810527MSPRDR02","LAURA MARGARITA MORENO RODRIGUEZ","01131","1003","53","2","CF34202","00.0",3328,"24DPT0003S",201315,"9",201303,201315,195,3146.71]
[null,"SAN LUIS POTOSI","NAOF731005JG9","NAOF731005MSPVRB07","FABIOLA PATRICIA NAVA ORTIZ","01131","1003","53","2","CF33206","00.0",14529,"24DPT0009M",201315,"9",201303,201315,195,8676.5600000000013]
[null,"SAN LUIS POTOSI","OAHG511209TY7","OAHG511209MMNRND19","MA. GUADALUPE Y. ORDAZ HUANTE","01131","1003","53","2","CF33206","00.0",11180,"24DPT0009X",201315,"9",201303,201315,195,7177.1500000000005]
[null,"SAN LUIS POTOSI","OECG711212T95","OECG711212MSPLSD02","MA. GUADALUPE OLVERA CASTILLO","01131","1003","53","2","A03202","00.0",3243,"24DPT0005Q",201315,"9",201303,201315,195,3944.4300000000003]
[null,"SAN LUIS POTOSI","PAEJ630307MI6","PAEJ630307MSPLSN09","JUANA PALACIOS ESTRADA","01131","1003","53","2","S01201","00.0",8154,"24DPT0007O",201315,"9",201303,201315,195,3637.59]
[null,"SAN LUIS POTOSI","PAFL651004EV0","PAFL651004MSPLLT06","LETICIA PAULIN FLORES","01131","1003","53","2","S01202","00.0",3289,"24DPT0005Q",201315,"9",201303,201315,195,3675.84]
[null,"SAN LUIS POTOSI","PAGG590530IA4","PAGG590530HSPRRB04","GABRIEL PAREDES GUERRERO","01131","1003","53","2","CF34202","00.0",3278,"24DPT0005Q",201315,"9",201303,201315,195,3753.98]
[null,"SAN LUIS POTOSI","PEHG680622FW8","PEHG680622MQTRRB00","GABRIELA PEREZ HERNANDEZ","01131","1003","53","2","CF19201","00.0",3307,"24DPT0001U",201315,"9",201303,201315,195,3869.1400000000003]
[null,"SAN LUIS POTOSI","PEIS651209PB0","PEIS651209MSPRBC02","MARIA DEL SOCORRO PEREZ IBARRA","01131","1003","53","2","CF33204","00.0",3331,"24DPT0001U",201315,"9",201303,201315,195,5926.9400000000005]
[null,"SAN LUIS POTOSI","PERM920321B89","PERM920321HSPXML06","MELCHOR IVAN PEÑA RAMIREZ","01131","1003","53","2","S01201","00.0",5103,"24DPT0003S",201315,"9",201303,201315,195,1307.75]
[null,"SAN LUIS POTOSI","PIPF601112G12","PIPF601112HCSNLR03","FRANCISCO RENATO PINEDA PALOMEQUE","01131","1003","53","2","CF33206","00.0",13133,"24DPT0007O",201315,"9",201303,201315,195,8351.94]
[null,"SAN LUIS POTOSI","PUCS731008NE9","PUCS731008HSPRRR06","SERGIO PURATA CRUZ","01131","1003","53","2","S01202","00.0",3334,"24DPT0001U",201315,"9",201303,201315,195,3431.9700000000003]
[null,"SAN LUIS POTOSI","RAAJ5411175IA","RAAJ541117HSPMMS03","JOSE RAMOS AMAYA","01131","1003","53","2","CF33206","00.0",9284,"24DPT0009M",201315,"9",201303,201315,195,9202.42]
[null,"SAN LUIS POTOSI","RAGJ5903149W1","RAGJ590314HSPMRN03","JUAN RAMOS GARCIA","01131","1003","53","2","S01202","00.0",3281,"24DPT0005Q",201315,"9",201303,201315,195,3750.28]
[null,"SAN LUIS POTOSI","RAGR661201RT1","RAGR661201HSPMRM02","RAMON RAMOS GARCIA","01131","1003","53","2","S01202","00.0",3282,"24DPT0005Q",201315,"9",201303,201315,195,3718.11]
[null,"SAN LUIS POTOSI","RAML640920MT9","RAML640920MSPNRR16","MA. DE LOURDES RANGEL MARTINEZ","01131","1003","53","2","CF19201","00.0",3245,"24DPT0005Q",201315,"9",201303,201315,195,3639.8300000000004]
[null,"SAN LUIS POTOSI","REMO730405JA0","REMO730405MVZDTJ15","OJILVIA REDONDO MATEOS","01131","1003","53","2","CF33204","00.0",3314,"24DPT0001U",201315,"9",201303,201315,195,5879.75]
[null,"SAN LUIS POTOSI","RILR531105JV6","RILR531105HSPVPF03","RAFAEL RIVERA LOPEZ","01131","1003","53","2","S01202","00.0",9267,"24DPT0009M",201315,"9",201303,201315,195,3861.5600000000004]
[null,"SAN LUIS POTOSI","RIPC880609KX9","RIPC880609MSPVLN03","CANDIDA NALLELY RIVERA PALACIOS","01131","1003","53","2","S01202","00.0",3322,"24DPT0001U",201315,"9",201303,201315,195,2993.9700000000003]
[null,"SAN LUIS POTOSI","ROAR710803LR5","ROAR710803HSPJLL08","RAUL ROJAS ALVARADO","01131","1003","53","2","CF33204","00.0",9248,"24DPT0003S",201315,"9",201303,201315,195,5996.39]
[null,"SAN LUIS POTOSI","ROAV540405B30","ROAV540405HSPCLC05","VICENTE ROCHA ALVARADO","01131","1003","53","2","CF33204","00.0",3271,"24DPT0009M",201315,"9",201303,201315,195,6651.1100000000006]
[null,"SAN LUIS POTOSI","ROCJ770306E42","ROCJ770306MSPDBS15","JESSICA ARELY RODRIGUEZ CABRERA","01131","1003","53","2","CF33204","00.0",3290,"24DPT0009X",201315,"9",201303,201315,195,5249.9800000000005]
[null,"SAN LUIS POTOSI","ROEH7612111R2","ROEH761211HTSJSG04","HUGO DANIEL ROJAS ESCAREÑO","01131","1003","53","2","S01201","00.0",3277,"24DPT0005Q",201315,"9",201303,201315,195,2948.8500000000004]
[null,"SAN LUIS POTOSI","ROHC591104GNA","ROHC591104HTSDRR02","CARLOS RODRIGUEZ HERNANDEZ","01131","1003","53","2","CF33206","00.0",14041,"24DPT0009M",201315,"9",201303,201315,195,9743.1]
[null,"SAN LUIS POTOSI","ROMJ691226UG8","ROMT691226HSPDLM00","JOSE TOMAS RODRIGUEZ MALDONADO","01131","1003","53","2","CF34202","00.0",3276,"24DPT0001U",201315,"9",201303,201315,195,1323.3]
[null,"SAN LUIS POTOSI","ROMN380628S80","ROMN380628HSPDTC04","NICOLAS RODRIGUEZ MATA","01131","1003","53","2","S01201","00.0",3285,"24DPT0005Q",201315,"9",201303,201315,195,3718.94]
[null,"SAN LUIS POTOSI","ROOJ620202C77","ROOJ620202MSPDRR00","JEORGINA RODRIGUEZ ORTEGA","01131","1003","53","2","CF21202","00.0",12114,"24DPT0005Q",201315,"9",201303,201315,195,3866.19]
[null,"SAN LUIS POTOSI","RORR520329DU7","RORR520329HTSJVB07","ROBERTO ROJAS RIVERO","01131","1003","53","2","CF18203","00.0",3286,"24DPT0005Q",201315,"9",201303,201315,195,4661.9800000000005]
[null,"SAN LUIS POTOSI","RORR811129MR5","RORR811129MSPCDC01","ROCIO ROCHA RODRIGUEZ","01131","1003","53","2","CF04201","00.0",8139,"24DPT0009M",201315,"9",201303,201315,195,3567.4500000000003]
[null,"SAN LUIS POTOSI","ROVC771023CW0","ROVC771023HSPMDR00","CARLOS ALBERTO ROMO VIDALES","01131","1003","53","2","A03202","00.0",3301,"24DPT0001U",201315,"9",201303,201315,195,3328.06]
[null,"SAN LUIS POTOSI","SAGM540516420","SAGM540516MMCNMN07","MINERVA ANA MARIA SANCHEZ GOMEZ","01131","1003","53","2","CF34201","00.0",8145,"24DPT0007O",201315,"9",201303,201315,195,3864.07]
[null,"SAN LUIS POTOSI","SAGR701024AV1","SAGR701024HSPLLF07","RAFAEL SALAS GALAVIZ","01131","1003","53","2","S01201","00.0",158,"24DPT0005Q",201315,"9",201303,201315,195,2867.4900000000002]
[null,"SAN LUIS POTOSI","SAHN7508099U9","SAHN750809MSPCRR08","NORMA DELIA SAUCEDA HERNANDEZ","01131","1003","53","2","S01201","00.0",5098,"24DPT0003S",201315,"9",201303,201315,195,2444.37]
[null,"SAN LUIS POTOSI","SAHS851106JW8","SAHS851106MSPNRL02","SELENE MILAGROS SANCHEZ HERNANDEZ","01131","1003","53","2","CF33206","00.0",13944,"24DPT0001U",201315,"9",201303,201315,195,6342.7300000000005]
[null,"SAN LUIS POTOSI","SAHV7005203N4","SAHV700520HSPLRC05","VICTOR HUGO SALAZAR HERRERA","01131","1003","53","2","CF33206","00.0",13946,"24DPT0003S",201315,"9",201303,201315,195,8316.35]
[null,"SAN LUIS POTOSI","SAPC761004QI1","SAPC761004MSPNRR02","CARMEN LISETTE SANCHEZ PEREZ","01131","1003","53","2","CF33206","00.0",13800,"24DPT0009X",201315,"9",201303,201315,195,8425.94]
[null,"SAN LUIS POTOSI","SARE6202234P9","SARE620223MGTNYL05","ELVA MARTHA SANCHEZ REYES","01131","1003","53","2","CF19201","00.0",9237,"24DPT0009M",201315,"9",201303,201315,195,3946.55]
[null,"SAN LUIS POTOSI","SARI650522GIA","SAXR650522MDGPXT03","RITA SAPATA .","01131","1003","53","2","CF34201","00.0",9273,"24DPT0009M",201315,"9",201303,201315,195,3743.54]
[null,"SAN LUIS POTOSI","SARL580921DP4","SARL580921MSPNYL00","LILIANA ARACELI SANCHEZ REYES","01131","1003","53","2","ED01201","00.0",3330,"24DPT0001U",201315,"9",201303,201315,195,4280.4800000000005]
[null,"SAN LUIS POTOSI","SARS600827T73","SARS600827HSPNYX08","SIXTO ARMANDO SANCHEZ REYES","01131","1003","53","2","ED01201","00.0",3329,"24DPT0001U",201315,"9",201303,201315,195,3616.0800000000004]
[null,"SAN LUIS POTOSI","SASC740427A77","SASC740427MSPNSY06","CYNTHIA ANGELICA SANCHEZ SESMA","01131","1003","53","2","CF33206","00.0",13855,"24DPT0009X",201315,"9",201303,201315,195,8676.5600000000013]
[null,"SAN LUIS POTOSI","SASD751228176","SASD751228MGTNNL02","MA. DOLORES SANCHEZ SANCHEZ","01131","1003","53","2","CF33204","00.0",8938,"24DPT0007O",201315,"9",201303,201315,195,5402.8600000000006]
[null,"SAN LUIS POTOSI","SAVY6603309K7","SAVY660330MSPNLL09","YOLANDA SANCHEZ VALENZUELA","01131","1003","53","2","CF33206","00.0",14530,"24DPT0001U",201315,"9",201303,201315,195,9813.49]
[null,"SAN LUIS POTOSI","SICJ650205IN3","SICJ650205HSPLSN04","JUAN FELIPE DE JE SILVA CASTILLO","01131","1003","53","2","CF34202","00.0",5113,"24DPT0003S",201315,"9",201303,201315,195,3748.44]
[null,"SAN LUIS POTOSI","SILJ7207131L2","SILJ720713HSPFPN00","JUAN FRANCISCO SIFUENTES LOPEZ","01131","1003","53","2","CF33206","00.0",14532,"24DPT0003S",201315,"9",201303,201315,195,7937.01]
[null,"SAN LUIS POTOSI","SIRS660627HNA","SIRS660627HSPRJR03","SERGIO SIRENO ROJAS","01131","1003","53","2","CF19201","00.0",5102,"24DPT0003S",201315,"9",201303,201315,195,3863.6600000000003]
[null,"SAN LUIS POTOSI","SURS62121622A","SURS621216HSPSCL09","JOSE SALVADOR SUSTAITA ROCHA","01131","1003","53","2","A03202","00.0",8141,"24DPT0005Q",201315,"9",201303,201315,195,3639.2200000000003]
[null,"SAN LUIS POTOSI","TEBO821119NQ5","TEBO821119HHGRLS07","OSCAR TREJO BELTRAN","01131","1003","53","2","S01201","00.0",3310,"24DPT0001U",201315,"9",201303,201315,195,2905.98]
[null,"SAN LUIS POTOSI","TEDR630916EX2","TEDR630916HSPLZG06","ROGELIO MARTIN TELLO DIAZ","01131","1003","53","2","A03202","00.0",3241,"24DPT0005Q",201315,"9",201303,201315,195,3999.4300000000003]
[null,"SAN LUIS POTOSI","TOCJ611031345","TOCJ611031MSPRRN04","JUANA MARIA TORRES CRUZ","01131","1003","53","2","S01202","00.0",9272,"24DPT0009M",201315,"9",201303,201315,195,3797.79]
[null,"SAN LUIS POTOSI","TOFJ781224GT6","TOFJ781224MSPRLS02","MARIA DE JESUS TORRES FLORES","01131","1003","53","2","S01202","00.0",9254,"24DPT0009M",201315,"9",201303,201315,195,3263.69]
[null,"SAN LUIS POTOSI","TOSC640102T47","TOSC640102MSPRLR03","CARMEN JULIA TORRES SOLIS","01131","1003","53","2","CF33206","00.0",13856,"24DPT0001U",201315,"9",201303,201315,195,8820.84]
[null,"SAN LUIS POTOSI","TOST581016ED7","TOST581016HGTRNR07","JOSE TERESO TORRES SANCHEZ","01131","1003","53","2","CF18203","00.0",11462,"24DPT0009M",201315,"9",201303,201315,195,4302.62]
[null,"SAN LUIS POTOSI","TUBA630811ME9","TUBA630811HSPDLL18","ALAYN TUDON BALDAZO","01131","1003","53","2","S01201","00.0",9234,"24DPT0009M",201315,"9",201303,201315,195,313.14000000000004]
[null,"SAN LUIS POTOSI","UOAE5801257F6","UOAE580125MSPLLL00","MARIA ELVIRA ULLOA ALVAREZ","01131","1003","53","2","S01202","00.0",9275,"24DPT0009M",201315,"9",201303,201315,195,3880.96]
[null,"SAN LUIS POTOSI","VACE770426NC0","VACE770426HSPZRR04","JOSE ERNESTO VAZQUEZ CARRION","01131","1003","53","2","S01201","00.0",5085,"24DPT0003S",201315,"9",201303,201315,195,2894.29]
[null,"SAN LUIS POTOSI","VARL840419V1A","VARL840419HSPZDS08","LUIS JAFET VAZQUEZ RODRIGUEZ","01131","1003","53","2","S01201","00.0",3306,"24DPT0001U",201315,"9",201303,201315,195,2803.8900000000003]
[null,"SAN LUIS POTOSI","VETL800309V15","VETL800309HSPLRS06","LUIS MANUEL VELAZQUEZ TREJO","01131","1003","53","2","S01202","00.0",3325,"24DPT0001U",201315,"9",201303,201315,195,3056.78]
[null,"SAN LUIS POTOSI","VIBE670614TR4","VIBE670614MSPLNL00","MARIA ELEAZAR VILLELA BUENO","01131","1003","53","2","CF33203","00.0",3291,"24DPT0005Q",201315,"9",201303,201315,195,4420.88]
[null,"SAN LUIS POTOSI","YEIJ5912243Z0","YEIJ591224HSPRBV07","JAVIER YERA IBARRA","01131","1003","53","2","CF33204","00.0",3292,"24DPT0009M",201315,"9",201303,201315,195,5694.84]
[null,"SAN LUIS POTOSI","ZARC720415D80","ZARC720415MSPMCR04","MARIA DEL CARMEN ZAMARRON ROCHA","01131","1003","53","2","A03202","00.0",3238,"24DPT0005Q",201315,"9",201303,201315,195,3553.3]
[null,"SAN LUIS POTOSI","ZASL640121432","ZASL640121MSPVTZ04","LUZ MARIA ZAVALZA STIKER","01131","1003","53","2","CF33204","00.0",9250,"24DPT0003S",201315,"9",201303,201315,195,5894.2300000000005]
[null,"SAN LUIS POTOSI","AAMG750317V44","AAMG750317MSPNDB04","GABRIELA ANDRADE MEDINA","01131",0,3,1,0,20,0,"24DPT0005Q",201317,"9",201303,201317,225,1418.3899999999999]
[null,"SAN LUIS POTOSI","BAME661107RG9","BAME661107HSPLCR00","JOSE ERNESTO BALDERAS MOCTEZUMA","01131",0,3,1,0,20,0,"24DPT0005Q",201317,"9",201303,201317,225,1458.78]
[null,"SAN LUIS POTOSI","CEPJ6204099P3","CEPJ620409HDFDNN07","JUAN MANUEL CEDILLO PONCE","01131",0,3,1,0,20,0,"24DPT0005Q",201317,"9",201303,201317,225,1204.2199999999998]
[null,"SAN LUIS POTOSI","CUAO5611296R8","CUAO561129HSPRLS04","OSCAR  CRUZ ALVARADO","01131",0,3,1,0,20,0,"24DPT0005Q",201317,"9",201303,201317,225,1444.52]
[null,"SAN LUIS POTOSI","FAGS780307E56","FAGS780307MSPCRS07","SUSANA FACUNDO GARCIA","01131",0,3,1,0,20,0,"24DPT0005Q",201317,"9",201303,201317,225,1444.86]
[null,"SAN LUIS POTOSI","GUMR6108145QI","GUMR610814HSPRXM05","JOSE RAMON GUERRERO  MUÑOZ","01131",0,3,1,0,20,0,"24DPT0005Q",201317,"9",201303,201317,225,966.56]
[null,"SAN LUIS POTOSI","GUMO6906207Z5","GUMO690620MNLRRL03","OLGA  GUERRERO  MORENO","01131",0,3,1,0,20,0,"24DPT0005Q",201317,"9",201303,201317,225,1262.1299999999999]
[null,"SAN LUIS POTOSI","HUHV741223MX5","HUHV741223HSPRRC01","VICTOR MANUEL HURTADO HERNANDEZ","01131",0,3,1,0,20,0,"24DPT0005Q",201317,"9",201303,201317,225,1376.69]
[null,"SAN LUIS POTOSI","MAGC760229LNA","MAGC760229HSPRLR06","JOSE CIRILO MARTINEZ GUEL","01131",0,3,1,0,20,0,"24DPT0005Q",201317,"9",201303,201317,225,748.14999999999907]
[null,"SAN LUIS POTOSI","MAHL760517HSP","MAHL760517HSPRRZ08","JOSE DE LA LUZ MARTINEZ HERNANDEZ","01131",0,3,1,0,20,0,"24DPT0005Q",201317,"9",201303,201317,225,1409.1599999999999]
[null,"SAN LUIS POTOSI","MEBS710610EM4","MEBS710610MSPNRL03","SILVIA MANUELA MENDEZ BRISEÑO","01131",0,3,1,0,12,0,"24DPT0005Q",201317,"9",201303,201317,225,888.1]
[null,"SAN LUIS POTOSI","MOCC7211273F5","MOCC721127MGTNRN03","CONCEPCION CATALINA MONASTERIO CRUZ","01131",0,3,1,0,20,0,"24DPT0005Q",201317,"9",201303,201317,225,1439.8999999999999]
[null,"SAN LUIS POTOSI","MOMJ8212233P2","MOMJ821223HSPTRS09","JOSE DE JESUS MOTA MARTINEZ","01131",0,3,1,0,8,0,"24DPT0005Q",201317,"9",201303,201317,225,-30.92]
[null,"SAN LUIS POTOSI","RASJ510626SU0","RASJ510626HSPMLS08","JESUS RAMIREZ SALDAÑA","01131",0,3,1,0,20,0,"24DPT0005Q",201317,"9",201303,201317,225,1468.1999999999998]
[null,"SAN LUIS POTOSI","RIHV8302182D1","RIGV830218MSPSNR03","VIRGINIA RIOS GONZALEZ","01131",0,3,1,0,20,0,"24DPT0005Q",201317,"9",201303,201317,225,1441.74]
[null,"SAN LUIS POTOSI","RESA7310259T4","RESA731025HSPYRN09","JOSE ANTONIO REYES SORIA","01131",0,3,1,0,4,0,"24DPT0005Q",201317,"9",201303,201317,225,338.46999999999997]
[null,"SAN LUIS POTOSI","ROAJ780411149","ROAJ780411HSPDVV15","JAVIER VLADIMIR RODRIGUEZ  AVALOS","01131",0,3,1,0,20,0,"24DPT0005Q",201317,"9",201303,201317,225,1356.63]
[null,"SAN LUIS POTOSI","TUAG691023FZ5","TUAG691023HSPRRS09","GUSTAVO TURRUBIARTES ARMENDARIZ","01131",0,3,1,0,16,0,"24DPT0005Q",201317,"9",201303,201317,225,13]
[null,"SAN LUIS POTOSI","ZAMO781007TN8","ZAMO781007HTSVRS09","OSCAR IGNACIO ZAVALA MARTINEZ","01131",0,3,1,0,20,0,"24DPT0005Q",201317,"9",201303,201317,225,1375.07]
[null,"SAN LUIS POTOSI","CAGA681224DN5","CAGA681224HSPBLR04","ARTURO CABRERA GALVAN ","01131",0,3,1,0,20,0,"24DPT0005Q",201317,"9",201303,201317,225,1629.92]
[null,"SAN LUIS POTOSI","CAML790315LT5","CALM790315MSPRLR01","LAURA GRISELDA CARLOS MELCHOR","01131",0,3,1,0,12,0,"24DPT0005Q",201317,"9",201303,201317,225,947.08]
[null,"SAN LUIS POTOSI","CEAL770411QU7","CEAL770411MSPRLR06","LORENA CERVANTES  ALMENDAREZ","01131",0,3,1,0,20,0,"24DPT0005Q",201317,"9",201303,201317,225,1639.97]
[null,"SAN LUIS POTOSI","COJP580618DF1","COJP580618HSPRRB03","PABLO CORPUS JUAREZ","01131",0,3,1,0,20,0,"24DPT0005Q",201317,"9",201303,201317,225,1638.23]
[null,"SAN LUIS POTOSI","EADC731211D23","EADC731211MSPSQL09","CLARA EMILIA ESPARZA DUQUE","01131",0,3,1,0,20,0,"24DPT0005Q",201317,"9",201303,201317,225,1637.4499999999998]
[null,"SAN LUIS POTOSI","FAMR5611097XA","FAMR561109HSPZLY02","JOSE REYNALDO FAZ MELENDEZ","01131",0,3,1,0,20,0,"24DPT0005Q",201317,"9",201303,201317,225,1594.68]
[null,"SAN LUIS POTOSI","GAHJ5112239S7","GAHJ511223HDFRRR08","JORGE GARCIA  HUERTA","01131",0,3,1,0,20,0,"24DPT0005Q",201317,"9",201303,201317,225,1633.2]
[null,"SAN LUIS POTOSI","GURJ631108BU2","GURJ631108HSPRYN00","JUAN ANTONIO GUERRERO  REYNA","01131",0,3,1,0,20,0,"24DPT0005Q",201317,"9",201303,201317,225,1613.5700000000002]
[null,"SAN LUIS POTOSI","MOHE770612FA9","MOHE770612MSPNRM06","MARIA EMILIA MONREAL HERNANDEZ","01131",0,3,1,0,20,0,"24DPT0005Q",201317,"9",201303,201317,225,1648.51]
[null,"SAN LUIS POTOSI","MUGJ740814TR0","MUGJ470814HDFXNN07","JUAN JESUS MUÑOZ GONZALEZ","01131",0,3,1,0,20,0,"24DPT0005Q",201317,"9",201303,201317,225,1621.26]
[null,"SAN LUIS POTOSI","PEAA520909BV4","PEAA520909HSPRRL08","ALFREDO PEREZ ARAUJO","01131",0,3,1,0,20,0,"24DPT0005Q",201317,"9",201303,201317,225,1635.8400000000001]
[null,"SAN LUIS POTOSI","ROCG640621IX7","ROCG640621HSPCRL08","GUILLERMO LUIS ROCHA CERDA","01131",0,3,1,0,20,0,"24DPT0005Q",201317,"9",201303,201317,225,1598.61]
[null,"SAN LUIS POTOSI","TOSM760208363","TOSM760802HSPRLG04","MIGUEL TORRES SALDAÑA","01131",0,3,1,0,20,0,"24DPT0005Q",201317,"9",201303,201317,225,1535.44]
[null,"SAN LUIS POTOSI","ZAEL5605308Z2","ZAEL560530HSPPSS02","JOSE LUIS ZAPATA ESQUIVEL","01131",0,3,1,0,20,0,"24DPT0005Q",201317,"9",201303,201317,225,1609.71]
[null,"SAN LUIS POTOSI","ZAER65101664A","ZAER651016MSPPSS05","ROSALVA ZAPATA ESQUIVEL","01131",0,3,1,0,20,0,"24DPT0005Q",201317,"9",201303,201317,225,1097.8800000000001]
[null,"SAN LUIS POTOSI","AEGJ710415S84","AEGJ710415HSPLML00","JULIO ALMENDAREZ GOMEZ","01131",0,3,1,0,20,0,"24DPT0005Q",201317,"9",201303,201317,225,1872.55]
[null,"SAN LUIS POTOSI","AOMM570312AV4","AOMM570312MSPLDR05","MARTHA ALONSO MEDELLIN","01131",0,3,1,0,20,0,"24DPT0005Q",201317,"9",201303,201317,225,1876.24]
[null,"SAN LUIS POTOSI","AAAH620408J7A","AAAH620408HSPLGC09","HECTOR ALVARADO AGUILAR","01131",0,3,1,0,20,0,"24DPT0005Q",201317,"9",201303,201317,225,1885.37]
[null,"SAN LUIS POTOSI","BIBJ740611411","BIBJ740611MDFRCR01","JERITZIA BRIONES BECERRIL","01131",0,3,1,0,20,0,"24DPT0005Q",201317,"9",201303,201317,225,1871.78]
[null,"SAN LUIS POTOSI","CAFV721223IG8","CAFV721223MSPMLC04","VICTORIA CAMPOS FLORES","01131",0,3,1,0,20,0,"24DPT0005Q",201317,"9",201303,201317,225,1886.6399999999899]
[null,"SAN LUIS POTOSI","CARL4406129D4","CARL440612HSPNDS00","JOSE DE JESUS L. CANDELARIA RODRIGUEZ ","01131",0,3,1,0,20,0,"24DPT0005Q",201317,"9",201303,201317,225,1852.0300000000002]
[null,"SAN LUIS POTOSI","DETR550304SL3","DETR550304HSPBPB07","ROBERTO DEBO  TAPIA","01131",0,3,1,0,20,0,"24DPT0005Q",201317,"9",201303,201317,225,1897.27]
[null,"SAN LUIS POTOSI","EAMS530908K58","EAMS530908HSPSNR05","SERGIO ESCALANTE MONREAL","01131",0,3,1,0,20,0,"24DPT0005Q",201317,"9",201303,201317,225,1879.2800000000002]
[null,"SAN LUIS POTOSI","EACM730411FGA","EACM730411MSPSRR00","MARISELA ESPARZA CERDA","01131",0,3,1,0,20,0,"24DPT0005Q",201317,"9",201303,201317,225,1899.1799999999998]
[null,"SAN LUIS POTOSI","GAGH690109G27","GAGH690109HTSTRR02","HERNANDO GAITAN  GARCIA","01131",0,3,1,0,20,0,"24DPT0005Q",201317,"9",201303,201317,225,1893.07]
[null,"SAN LUIS POTOSI","GALR720507BR2","GALR720507HSPLPB07","ROBERTO GALARZA LOPEZ","01131",0,3,1,0,20,0,"24DPT0005Q",201317,"9",201303,201317,225,1199.8499999999999]
[null,"SAN LUIS POTOSI","GAMJ740817IB0  ","GAMJ740817HSPRXS06","JOSE DE JESUS GARCIA  MUÑIZ","01131",0,3,1,0,20,0,"24DPT0005Q",201317,"9",201303,201317,225,1843.8099999999899]
[null,"SAN LUIS POTOSI","GOGG5603254M4","GOGG560325HSPNNB00","GABRIEL GONZALEZ GONZALEZ","01131",0,3,1,0,20,0,"24DPT0005Q",201317,"9",201303,201317,225,1851.99999999999]
[null,"SAN LUIS POTOSI","GOMJ610824C57","GOMJ610824HSPNRS00","JOSE GONZALEZ MARQUEZ","01131",0,3,1,0,20,0,"24DPT0005Q",201317,"9",201303,201317,225,1886.55]
[null,"SAN LUIS POTOSI","GUNG7012058H2","GUNG701205MSPRYD06","MA. GUADALUPE GUERRERO  NOYOLA","01131",0,3,1,0,20,0,"24DPT0005Q",201317,"9",201303,201317,225,1721.9699999999898]
[null,"SAN LUIS POTOSI","HEHR531031IA9","HEHR531031HTSRRB09","ROBERTO HERNANDEZ HERNANDEZ","01131",0,3,1,0,16,0,"24DPT0005Q",201317,"9",201303,201317,225,23.789999999999992]
[null,"SAN LUIS POTOSI","HEMM741229CT4","HEMM741229MSPRTR00","MARICELA HERNANDEZ MATA","01131",0,3,1,0,20,0,"24DPT0005Q",201317,"9",201303,201317,225,1865.98999999999]
[null,"SAN LUIS POTOSI","HILR550718H26","HILR550718HSPDPY09","REYNALDO HIDALGO LOPEZ","01131",0,3,1,0,20,0,"24DPT0005Q",201317,"9",201303,201317,225,1701.94]
[null,"SAN LUIS POTOSI","JADJ611209J81","JADJ611209HSPSZL06","JOEL JASSO DIAZ DE LEON","01131",0,3,1,0,20,0,"24DPT0005Q",201317,"9",201303,201317,225,1883.62]
[null,"SAN LUIS POTOSI","LASE7210152Z4","LASE721015MSPRLL05","MARIA ELIZABETH LARA SALAZAR","01131",0,3,1,0,20,0,"24DPT0005Q",201317,"9",201303,201317,225,1863.1999999999898]
[null,"SAN LUIS POTOSI","LEGV7511103D7","LEGV751110MSPJMC08","MARIA VICTORIA LEIJA GAMEZ","01131",0,3,1,0,20,0,"24DPT0005Q",201317,"9",201303,201317,225,1870.85]
[null,"SAN LUIS POTOSI","MASJ701225MPA","MASJ701225MSPRNC05","JACQUELINE MARQUEZ SANCHEZ","01131",0,3,1,0,20,0,"24DPT0005Q",201317,"9",201303,201317,225,1877.9599999999898]
[null,"SAN LUIS POTOSI","MAAA780120V62","MAAA780120MSPRNL01","ALMA GEORGINA MARTIN DEL CAMPO DE ANDA","01131",0,3,1,0,20,0,"24DPT0005Q",201317,"9",201303,201317,225,1904.8400000000001]
[null,"SAN LUIS POTOSI","MACA571230PH6","MACA571230HSPRRP02","APOLINAR MARTINEZ CRUZ","01131",0,3,1,0,20,0,"24DPT0005Q",201317,"9",201303,201317,225,1899.6]
[null,"SAN LUIS POTOSI","MADP601115KJ2","MADP601115HSPRVB08","PABLO ALBERTO MARTINEZ  DAVILA","01131",0,3,1,0,20,0,"24DPT0005Q",201317,"9",201303,201317,225,1879.76999999999]
[null,"SAN LUIS POTOSI","MAMN741116431","MAMN741116MSPRNL00","NELY MARTINEZ MENDEZ","01131",0,3,1,0,20,0,"24DPT0005Q",201317,"9",201303,201317,225,1835.8899999999999]
[null,"SAN LUIS POTOSI","MAMA610628PT8","MAMA610628MSPRXL03","ALICIA MARTINEZ MUÑOZ","01131",0,3,1,0,20,0,"24DPT0005Q",201317,"9",201303,201317,225,1882.46]
[null,"SAN LUIS POTOSI","MAVA580913UN9","MAVA580913HSPRGN04","ANTONIO MARTINEZ VEGA","01131",0,3,1,0,12,0,"24DPT0005Q",201317,"9",201303,201317,225,1840.55]
[null,"SAN LUIS POTOSI","MEDA710331LD8","MEDA710331MSPLZR07","MARIA ARACELI MELCHOR DIAZ DE LEON","01131",0,3,1,0,20,0,"24DPT0005Q",201317,"9",201303,201317,225,1904.52]
[null,"SAN LUIS POTOSI","MEMF650811L66","MEMF650811HSPNRL08","FELIPE MENDEZ MORENO","01131",0,3,1,0,20,0,"24DPT0005Q",201317,"9",201303,201317,225,1899.6]
[null,"SAN LUIS POTOSI","NICH500406FIA","NICH500406HOCCRC04","HECTOR NICOLAS CRUZ","01131",0,3,1,0,20,0,"24DPT0005Q",201317,"9",201303,201317,225,1890.31]
[null,"SAN LUIS POTOSI","OOSL700110939","OOSL700110HSPLLS06","JOSE LUIS OLMOS SALINAS","01131",0,3,1,0,20,0,"24DPT0005Q",201317,"9",201303,201317,225,1710.8499999999901]
[null,"SAN LUIS POTOSI","OIOR520826S36","OIOR520826HSPNLB09","ROBERTO ONTIVEROS  OLVERA","01131",0,3,1,0,20,0,"24DPT0005Q",201317,"9",201303,201317,225,1893.07]
[null,"SAN LUIS POTOSI","OONI7406107B6","OONI740610MSPRRS07","ISABEL OROZCO NARVAEZ","01131",0,3,1,0,20,0,"24DPT0005Q",201317,"9",201303,201317,225,1879.29000000001]
[null,"SAN LUIS POTOSI","PELA710227AF5","PELA710227HSPRRN06","ANTONIO ALEJANDRO PEREZ  LOREDO","01131",0,3,1,0,20,0,"24DPT0005Q",201317,"9",201303,201317,225,1761.1799999999901]
[null,"SAN LUIS POTOSI","REAJ550308GR7","REAJ550308HMCYLN03","JUAN REYES  ALANIS","01131",0,3,1,0,20,0,"24DPT0005Q",201317,"9",201303,201317,225,1899.6]
[null,"SAN LUIS POTOSI","ROGJ611105BLA","ROGJ611005HSPCVV07","JAVIER ROCHA GUEVARA","01131",0,3,1,0,20,0,"24DPT0005Q",201317,"9",201303,201317,225,1862.8699999999899]
[null,"SAN LUIS POTOSI","ROHR550913UA8","ROHR550913HSPCRB08","RUBEN ROCHA HERNANDEZ","01131",0,3,1,0,20,0,"24DPT0005Q",201317,"9",201303,201317,225,1877.8200000000002]
[null,"SAN LUIS POTOSI","SAML701004NU0","SAML701004MSPLRR09","LAURA GEORGINA SALAS MART1NEZ","01131",0,3,1,0,20,0,"24DPT0005Q",201317,"9",201303,201317,225,1893.07]
[null,"SAN LUIS POTOSI","SAHD750908E51","SAHD750908HSPNRV09","DAVID ANGEL SANCHEZ HERNANDEZ","01131",0,3,1,0,20,0,"24DPT0005Q",201317,"9",201303,201317,225,1812.41]
[null,"SAN LUIS POTOSI","SITO710826RY5","SITO710826MSPLPL07","OLGA LIDIA SILVA TAPIA","01131",0,3,1,0,20,0,"24DPT0005Q",201317,"9",201303,201317,225,1898.9]
[null,"SAN LUIS POTOSI","SOAT6101048K8","SOAT610104HVZSNM18","TOMAS SOSA DEL ANGEL","01131",0,3,1,0,20,0,"24DPT0005Q",201317,"9",201303,201317,225,1893.07]
[null,"SAN LUIS POTOSI","VEGE630912DG6","VEGE630912MSPGRM06","MARIA ESTELA VEGA GUERRERO","01131",0,3,1,0,20,0,"24DPT0005Q",201317,"9",201303,201317,225,1846.9399999999998]
[null,"SAN LUIS POTOSI","VILR551117J86","VILR551117MSPLNS02","MARIA DEL ROSARIO VILLA DE LEON","01131",0,3,1,0,20,0,"24DPT0005Q",201317,"9",201303,201317,225,1892.11]
[null,"SAN LUIS POTOSI","AERJ5601224J5","AERJ560122HZSCDM02","JAIME ACEVEDO  RODRIGUEZ","01131",0,3,1,0,20,0,"24DPT0009M",201317,"9",201303,201317,225,1487.06]
[null,"SAN LUIS POTOSI","AURC720705L18","AURC720705HSPGDR08","J. CRUZ FRANCISCO AGUILLON RODRIGUEZ","01131",0,3,1,0,20,0,"24DPT0009M",201317,"9",201303,201317,225,1355.4199999999898]
[null,"SAN LUIS POTOSI","AARA750630J19","AARA750630MSPLBN00","ANA KARINA ALVARADO ROBLEDO","01131",0,3,1,0,20,0,"24DPT0009M",201317,"9",201303,201317,225,1450.53]
[null,"SAN LUIS POTOSI","AEBJ400825AUA","AEBJ400825HDFRLL08","JOEL ARMENDARIZ BLAZQUEZ","01131",0,3,1,0,20,0,"24DPT0009M",201317,"9",201303,201317,225,1530.5800000000002]
[null,"SAN LUIS POTOSI","AAMI700628346","AAMI700628MSPYNS03","MARIA ISABEL AYALA  MANRIQUE","01131",0,3,1,0,20,0,"24DPT0009M",201317,"9",201303,201317,225,1854.73]
[null,"SAN LUIS POTOSI","AUZR620708VP7","AUZR620708MSPZXS00","ROSA MARIA AZUA ZUÑIGA","01131",0,3,1,0,20,0,"24DPT0009M",201317,"9",201303,201317,225,1878.03999999999]
[null,"SAN LUIS POTOSI","BECA5712192K9","BECA571219HGRNRD04","ADAN BENITEZ  CARDOSO","01131",0,3,1,0,20,0,"24DPT0009M",201317,"9",201303,201317,225,860.92500000000007]
[null,"SAN LUIS POTOSI","BERH801030EA1","BERH801030HSPRBR04","HIRAM ISRAEL BERNAL  ROBLEDO","01131",0,3,1,0,20,0,"24DPT0009M",201317,"9",201303,201317,225,1428.0800000000002]
[null,"SAN LUIS POTOSI","BEGB530213FVA","BEGB530213HSPTMN03","BENIGNO  BETANCOURT GOMEZ","01131",0,3,1,0,20,0,"24DPT0009M",201317,"9",201303,201317,225,1813.56]
[null,"SAN LUIS POTOSI","CAGC810922339","CAGC810922MSPNZL09","CLAUDIA IVONE CANELA  GUZMAN","01131",0,3,1,0,20,0,"24DPT0009M",201317,"9",201303,201317,225,1419.0999999999899]
[null,"SAN LUIS POTOSI","CEGJ59031222A","CEGJ590312MSPRRS11","JOSEFINA CERDA GARCIA","01131",0,3,1,0,20,0,"24DPT0009M",201317,"9",201303,201317,225,1884.45]
[null,"SAN LUIS POTOSI","CORR640814PJ5","CORR640814HSPLDF04","RAFAEL MARTIN COLUNGA RODRIGUEZ","01131",0,3,1,0,20,0,"24DPT0009M",201317,"9",201303,201317,225,1229.4310000000019]
[null,"SAN LUIS POTOSI","COHM800901KC1","COHM800901MSPRRR06","MARY CRUZ CORDOVA HERNANDEZ","01131",0,3,1,0,20,0,"24DPT0009M",201317,"9",201303,201317,225,1449.4099999999899]
[null,"SAN LUIS POTOSI","COAL690815CZ6","COAL690815MSPRRR09","LAURA CORTES ARRIAGA","01131",0,3,1,0,20,0,"24DPT0009M",201317,"9",201303,201317,225,1617.4099999999999]
[null,"SAN LUIS POTOSI","DESC5311153R9","DESC531115MSPLVR05","MARIA DEL CARMEN DELGADO SAAVEDRA","01131",0,3,1,0,20,0,"24DPT0009M",201317,"9",201303,201317,225,1858.32]
[null,"SAN LUIS POTOSI","DIDM570116BV9","DIDM570116MSPZVR09","MARCELA IMELDA DIAZ DAVILA","01131",0,3,1,0,20,0,"24DPT0009M",201317,"9",201303,201317,225,1356.8899999999999]
[null,"SAN LUIS POTOSI","DIPA460121GU5","DIPA460121HSPZDN04","JOSE ANTONIO DIAZ  PEDROZA","01131",0,3,1,0,10,0,"24DPT0009M",201317,"9",201303,201317,225,842.6]
[null,"SAN LUIS POTOSI","EAAL600305LZ9","EAAL600305HCHSLS03","JOSE LUIS ESCAMILLA ALVARADO","01131",0,3,1,0,20,0,"24DPT0009M",201317,"9",201303,201317,225,1347.71]
[null,"SAN LUIS POTOSI","EIGJ460405L10","EIGJ460405HHGSRR06","JORGE VICENTE ESPINOLA GARCIA","01131",0,3,1,0,20,0,"24DPT0009M",201317,"9",201303,201317,225,1448.5900000000001]
[null,"SAN LUIS POTOSI","EAHM671124PBA","EAHM671124MTSSRG07","MAGALY ESTRADA HERNANDEZ","01131",0,3,1,0,20,0,"24DPT0009M",201317,"9",201303,201317,225,1842.9199999999901]
[null,"SAN LUIS POTOSI","FOAJ440312DR1","FOAJ440312HSPLLV01","JAVIER FLORES ALVARADO","01131",0,3,1,0,20,0,"24DPT0009M",201317,"9",201303,201317,225,1624.7600000000102]
[null,"SAN LUIS POTOSI","GAAJ560927TMA","GAAJ560927HZSLLS17","J. JESUS GALVAN ALVAREZ","01131",0,3,1,0,20,0,"24DPT0009M",201317,"9",201303,201317,225,1861.5600000000002]
[null,"SAN LUIS POTOSI","GACG681201AW1","GACG681201MSPLSR09","MARIA GRISELDA GALVAN CASTRO","01131",0,3,1,0,20,0,"24DPT0009M",201317,"9",201303,201317,225,1761.51]
[null,"SAN LUIS POTOSI","GAGA651210UL1","GAGA651210HSPRRL03","ALFREDO GARCIA GARCIA","01131",0,3,1,0,20,0,"24DPT0009M",201317,"9",201303,201317,225,1869.84]
[null,"SAN LUIS POTOSI","GARR550513GQ5","GARR550513HSPRDB07","ROBERTO PORFIRIO GARCIA RODRIGUEZ","01131",0,3,1,0,20,0,"24DPT0009M",201317,"9",201303,201317,225,1282.4699999999998]
[null,"SAN LUIS POTOSI","GAGA480307S50","GAGA480307HSPSND09","JOSE ADRIAN GASCA GONZALEZ","01131",0,3,1,0,20,0,"24DPT0009M",201317,"9",201303,201317,225,1446.91]
[null,"SAN LUIS POTOSI","GOMJ530811FX9","GOMJ530811HSPDRN03","JUAN ANTONIO GODINEZ MARTINEZ","01131",0,3,1,0,20,0,"24DPT0009M",201317,"9",201303,201317,225,1322.01]
[null,"SAN LUIS POTOSI","GOFR541109T40","GOFR541109HGTMLC03","RICARDO GOMEZ FLORES","01131",0,3,1,0,20,0,"24DPT0009M",201317,"9",201303,201317,225,1449.82]
[null,"SAN LUIS POTOSI","GOGA740612IUA","GOGA740612MMCMVL12","ALMA DELIA GOMEZ GUEVARA","01131",0,3,1,0,20,0,"24DPT0009M",201317,"9",201303,201317,225,1503.3300000000002]
[null,"SAN LUIS POTOSI","GOAK791020NR5","GOAK791020MSPNBR02","KARLA GONZALEZ ABUNDIS","01131",0,3,1,0,20,0,"24DPT0009M",201317,"9",201303,201317,225,1241.67]
[null,"SAN LUIS POTOSI","GOAF5909036GO","GOAF590903HSPNLR01","FERNANDO  GONZALEZ ALMENDAREZ","01131",0,3,1,0,20,0,"24DPT0009M",201317,"9",201303,201317,225,1383.51999999999]
[null,"SAN LUIS POTOSI","GOGV400220AE2","GOGV400220HSPNNC13","VICTOR GONZALEZ GONZALEZ","01131",0,3,1,0,20,0,"24DPT0009M",201317,"9",201303,201317,225,1631.1599999999999]
[null,"SAN LUIS POTOSI","GOLL770316DG2","GOLL770316MSPNPR02","LAURA PATRICIA GONZALEZ LOPEZ","01131",0,3,1,0,20,0,"24DPT0009M",201317,"9",201303,201317,225,1858.8700000000001]
[null,"SAN LUIS POTOSI","GUMF450823BM4","GUMF450823HSPRRL02","FELIPE GUERRERO MARTINEZ","01131",0,3,1,0,20,0,"24DPT0009M",201317,"9",201303,201317,225,1450.51]
[null,"SAN LUIS POTOSI","GUHJ580201NN2","GUHJ580201MSPTRN07","JUANA ROSALBA GUTIERREZ HUERTA","01131",0,3,1,0,20,0,"24DPT0009M",201317,"9",201303,201317,225,1632.59]
[null,"SAN LUIS POTOSI","HEBI760906877","HEBI760906MSPRLN03","INDIRA ITZEL HERNANDEZ BLANCO","01131",0,3,1,0,20,0,"24DPT0009M",201317,"9",201303,201317,225,1509.46]
[null,"SAN LUIS POTOSI","HEGS811219AY5","HEGS811219HSPRRR04","SERGIO EDUARDO HERNANDEZ GARCIA","01131",0,3,1,0,20,0,"24DPT0009M",201317,"9",201303,201317,225,1146.79]
[null,"SAN LUIS POTOSI","HEGA550329U57","HEGA550329MSPRTN07","ANA MA. VIOLETA HERNANDEZ GUTIERREZ","01131",0,3,1,0,20,0,"24DPT0009M",201317,"9",201303,201317,225,1437.6299999999999]
[null,"SAN LUIS POTOSI","HEJV660214BB3","HEJV660214HSPRRL02","JOSE VALENTIN HERNANDEZ JARA","01131",0,3,1,0,20,0,"24DPT0009M",201317,"9",201303,201317,225,1369.1799999999898]
[null,"SAN LUIS POTOSI","HELD680228RP9","HELD680228HSPRPV08","DAVID HERNANDEZ LOPEZ","01131",0,3,1,0,20,0,"24DPT0009M",201317,"9",201303,201317,225,1875.08]
[null,"SAN LUIS POTOSI","IASL4403122B2","IASL440312HSPZLC11","LUCAS  IZAGUIRRE SILVA","01131",0,3,1,0,20,0,"24DPT0009M",201317,"9",201303,201317,225,1533.19]
[null,"SAN LUIS POTOSI","JAML440222QT9","JAML440222HDFMRS07","JOSE LUIS JAIMES MURILLO","01131",0,3,1,0,20,0,"24DPT0009M",201317,"9",201303,201317,225,1513.4499999999998]
[null,"SAN LUIS POTOSI","JISJ781111L10","JISJ781111MSPMLN01","JANI ARELI JIMENEZ SILVA","01131",0,3,1,0,20,0,"24DPT0009M",201317,"9",201303,201317,225,1599.82]
[null,"SAN LUIS POTOSI","LEMS430127168","LEMS430127HJCDRL07","SALVADOR LEDESMA MARTINEZ","01131",0,3,1,0,20,0,"24DPT0009M",201317,"9",201303,201317,225,1871.4299999999901]
[null,"SAN LUIS POTOSI","LEGP7009225B7","LEGP700922MSPRNT06","MARIA PATRICIA LEURA GONZALEZ","01131",0,3,1,0,20,0,"24DPT0009M",201317,"9",201303,201317,225,1869.9599999999898]
[null,"SAN LUIS POTOSI","LOAF6906051R4","LOAF690605HGTPRL07","FELIX MANUEL LOPEZ ARMAS","01131",0,3,1,0,20,0,"24DPT0009M",201317,"9",201303,201317,225,1437.5]
[null,"SAN LUIS POTOSI","LOHJ6210136P8","LOHJ621013MSPPRV08","MA. JOVITA LOPEZ HERNANDEZ","01131",0,3,1,0,20,0,"24DPT0009M",201317,"9",201303,201317,225,1871.44]
[null,"SAN LUIS POTOSI","MABE7612078W9","MABE761207MSPRRD09","EDISA MARQUEZ BARRIOS","01131",0,3,1,0,20,0,"24DPT0009M",201317,"9",201303,201317,225,1888.2]
[null,"SAN LUIS POTOSI","MAAA8603143Z2","MAAA860314HSPRLN07","JOSE ANTONIO MARTINEZ ALVARADO","01131",0,3,1,0,20,0,"24DPT0009M",201317,"9",201303,201317,225,1433.62]
[null,"SAN LUIS POTOSI","MAAY830329C07","MAAY830329MSPRLN06","YENDI NAYELI MARTINEZ ALVARADO","01131",0,3,1,0,20,0,"24DPT0009M",201317,"9",201303,201317,225,1519.56]
[null,"SAN LUIS POTOSI","MACR460808JL8","MACR460808HDFRRG01","ROGELIO MARTINEZ CARDENAS","01131",0,3,1,0,20,0,"24DPT0009M",201317,"9",201303,201317,225,1739.6599999999999]
[null,"SAN LUIS POTOSI","MASB6902131Q9","MASB690213MSPRCL09","BLANCA ESTELA MARTINEZ SAUCEDO","01131",0,3,1,0,20,0,"24DPT0009M",201317,"9",201303,201317,225,1334.7]
[null,"SAN LUIS POTOSI","MOEA5904238FA","MOEA590423HGTCSD04","ADALBERTO MOCTEZUMA ESTRADA","01131",0,3,1,0,20,0,"24DPT0009M",201317,"9",201303,201317,225,1861.77]
[null,"SAN LUIS POTOSI","MOSM5107184H6","MOSM510718HSPSVR01","MARCO ANTONIO MONSIVAIS SAAVEDRA","01131",0,3,1,0,20,0,"24DPT0009M",201317,"9",201303,201317,225,1881.86]
[null,"SAN LUIS POTOSI","MOPR760718F85","MOPR760718HSPNDF01","RAFAEL   MONTANTE PADRON","01131",0,3,1,0,20,0,"24DPT0009M",201317,"9",201303,201317,225,1618.6500000000101]
[null,"SAN LUIS POTOSI","MOPR6303238X2","MOPR630323MSPRRS06","ROSA AURELIA MORAN PERALES","01131",0,3,1,0,20,0,"24DPT0009M",201317,"9",201303,201317,225,1877.96]
[null,"SAN LUIS POTOSI","MOGC610503EQ7","MOGC610503HSPRRR03","JOSE CRUZ MORENO  GUERRERO","01131",0,3,1,0,20,0,"24DPT0009M",201317,"9",201303,201317,225,1689.87]
[null,"SAN LUIS POTOSI","NALG680106UY1","NALG680106MSPVPB05","GABRIELA NAVARRO LOPEZ","01131",0,3,1,0,20,0,"24DPT0009M",201317,"9",201303,201317,225,1048.68]
[null,"SAN LUIS POTOSI","NORI770117MK2","NORI770117MVZCYR00","IRANI CRISTAL NOUCHE REYNA","01131",0,3,1,0,20,0,"24DPT0009M",201317,"9",201303,201317,225,1317.51]
[null,"SAN LUIS POTOSI","OELA460529MR5","OELA460529MSPRSL02","ALEJANDRINA ORELLANA LASTRE","01131",0,3,1,0,16,0,"24DPT0009M",201317,"9",201303,201317,225,1299.6699999999998]
[null,"SAN LUIS POTOSI","OEDS690601H87","OEDS690601MSPRZL01","SILVIA GUADALUPE ORTEGA DIAZ","01131",0,3,1,0,20,0,"24DPT0009M",201317,"9",201303,201317,225,1452.45]
[null,"SAN LUIS POTOSI","PEDL500618HKA","PEDL500618HASRRS04","JOSE LUIS PERALES DURAN","01131",0,3,1,0,10,0,"24DPT0009M",201317,"9",201303,201317,225,716.86]
[null,"SAN LUIS POTOSI","PEDY750108K77","PEDY750108MSPRZL03","YOLANDA GRICELDA PEREZ DIAZ","01131",0,3,1,0,20,0,"24DPT0009M",201317,"9",201303,201317,225,1302.99]
[null,"SAN LUIS POTOSI","PEGR600809AM3","PEGR600809HSPRRM02","ROMAN PEREZ GARCIA","01131",0,3,1,0,20,0,"24DPT0009M",201317,"9",201303,201317,225,1592.51]
[null,"SAN LUIS POTOSI","PIPG620110UQ4","PIPG620110MCSNLD07","MARIA GUADALUPE PINEDA PALOMEQUE","01131",0,3,1,0,20,0,"24DPT0009M",201317,"9",201303,201317,225,1392.76999999999]
[null,"SAN LUIS POTOSI","PIPM7007029U3","PIPM700702HOCNLR01","MARTIN OTHON PINEDA PALOMEQUE","01131",0,3,1,0,20,0,"24DPT0009M",201317,"9",201303,201317,225,1624.31]
[null,"SAN LUIS POTOSI","RAMJ530309U28","RAMJ530309HSPMNN00","JOSE JUAN RAMIREZ MENDEZ","01131",0,3,1,0,20,0,"24DPT0009M",201317,"9",201303,201317,225,1596.94]
[null,"SAN LUIS POTOSI","RAMA401010NW3","RAMA401010HSPMRG01","AGUSTIN RAMIREZ MURGUIA","01131",0,3,1,0,20,0,"24DPT0009M",201317,"9",201303,201317,225,1655.6100000000001]
[null,"SAN LUIS POTOSI","RARF540425K35","RARF540425HSPMND06","FEDERICO RAMIREZ RINCON","01131",0,3,1,0,20,0,"24DPT0009M",201317,"9",201303,201317,225,1883.53999999999]
[null,"SAN LUIS POTOSI","RAYL6402118J6","RAYL640211MSPMXZ05","LUZ ELENA RAMIREZ YAÑEZ","01131",0,3,1,0,20,0,"24DPT0009M",201317,"9",201303,201317,225,1426.3199999999899]
[null,"SAN LUIS POTOSI","RIBE540723J49","RIBE540723HSPVRD02","EDUARDO RIVERA BERRONES","01131",0,3,1,0,20,0,"24DPT0009M",201317,"9",201303,201317,225,1437.79]
[null,"SAN LUIS POTOSI","RITL670216PK8","RITL670216HSPVRS00","LUIS FERNANDO RIVERA TURRUBIARTES","01131",0,3,1,0,20,0,"24DPT0009M",201317,"9",201303,201317,225,1609.58]
[null,"SAN LUIS POTOSI","ROGO7506208V4","ROGO750620MJCDRL18","OLGA MIRIAM RODRIGUEZ GARCIA","01131",0,3,1,0,20,0,"24DPT0009M",201317,"9",201303,201317,225,1444.02999999999]
[null,"SAN LUIS POTOSI","ROMF680716254","ROMF680716HSPDRR09","FRANCISCO JAVIER RODRIGUEZ MARQUEZ","01131",0,3,1,0,20,0,"24DPT0009M",201317,"9",201303,201317,225,1887.3799999999901]
[null,"SAN LUIS POTOSI","RONR760726R81","RONR760726HSPDRB01","ROBERTO   RODRIGUEZ NARVAEZ","01131",0,3,1,0,20,0,"24DPT0009M",201317,"9",201303,201317,225,1617.08]
[null,"SAN LUIS POTOSI","RORA6702065V1","RORA670206HDGDDR08","ARMANDO RODRIGUEZ RODRIGUEZ","01131",0,3,1,0,20,0,"24DPT0009M",201317,"9",201303,201317,225,1643.42]
[null,"SAN LUIS POTOSI","RORB561112GP8","RORB561112HSPJDN08","BENJAMIN ROJAS RODRIGUEZ","01131",0,3,1,0,20,0,"24DPT0009M",201317,"9",201303,201317,225,1666.04]
[null,"SAN LUIS POTOSI","RURR611024AS4","RURR611024HSPZNF04","RAFAEL RUIZ RANGEL","01131",0,3,1,0,20,0,"24DPT0009M",201317,"9",201303,201317,225,1371.55]
[null,"SAN LUIS POTOSI","RUSO760607LB8","RUSO760607MSPVGL03","OLGA ELENA RUVALCABA SEGURA","01131",0,3,1,0,20,0,"24DPT0009M",201317,"9",201303,201317,225,1369.28]
[null,"SAN LUIS POTOSI","SADR780305K50","SADR780305HSPLSF09","RAFAEL SALADO  DIOSDADO","01131",0,3,1,0,20,0,"24DPT0009M",201317,"9",201303,201317,225,1427.15]
[null,"SAN LUIS POTOSI","SASG591128V18","SASG591128HSPNLD09","JOSE GUADALUPE SANCHEZ SILVA","01131",0,3,1,0,20,0,"24DPT0009M",201317,"9",201303,201317,225,1851.51]
[null,"SAN LUIS POTOSI","SETM681012ASA","SETM681012HSPRRR01","JOSE MARTIN SERNA TORRES","01131",0,3,1,0,20,0,"24DPT0009M",201317,"9",201303,201317,225,1617.58]
[null,"SAN LUIS POTOSI","SIMV7104087G7","SIMV710408HSPRNC00","VICTOR MANUEL SIERRA MONTOYA","01131",0,3,1,0,20,0,"24DPT0009M",201317,"9",201303,201317,225,1448.96]
[null,"SAN LUIS POTOSI","SIRJ740930AC0","SIRJ740930HCLLDL04","JULIAN SILOS RODRIGUEZ","01131",0,3,1,0,20,0,"24DPT0009M",201317,"9",201303,201317,225,1574.73]
[null,"SAN LUIS POTOSI","SIVR460513GK8","SIVR460513HSPLRB09","ROBERTO SILVA VARGAS","01131",0,3,1,0,20,0,"24DPT0009M",201317,"9",201303,201317,225,1060.1499999999999]
[null,"SAN LUIS POTOSI","TOMI610628R81","TOMI610628MSPRNS04","MARIA ISABEL TORRES MONTERO","01131",0,3,1,0,20,0,"24DPT0009M",201317,"9",201303,201317,225,1513.36]
[null,"SAN LUIS POTOSI","VAMR7708202Y9","VAMR770820MSPLRC07","ROCIO YUNUEN VALDIVIA MARQUEZ","01131",0,3,1,0,20,0,"24DPT0009M",201317,"9",201303,201317,225,1432.19]
[null,"SAN LUIS POTOSI","VARA690110SH8","VARA690110HSPRMN02","JOSE ANGEL VARGAS RAMIREZ","01131",0,3,1,0,20,0,"24DPT0009M",201317,"9",201303,201317,225,1874.28]
[null,"SAN LUIS POTOSI","VAAM801130154","VAAM801130MSPZRR08","MARY LINDA VAZQUEZ ARIAS","01131",0,3,1,0,20,0,"24DPT0009M",201317,"9",201303,201317,225,1423.5799999999899]
[null,"SAN LUIS POTOSI","VAHA700212797","VAHA700212MTSZRR08","ARISTEA VAZQUEZ HERNANDEZ","01131",0,3,1,0,20,0,"24DPT0009M",201317,"9",201303,201317,225,1326.38]
[null,"SAN LUIS POTOSI","VELN790226NK7","VELN790226HSPGPS08","NESTOR DAVID VEGA LOPEZ","01131",0,3,1,0,20,0,"24DPT0009M",201317,"9",201303,201317,225,1540.66]
[null,"SAN LUIS POTOSI","VEME560602PR6","VEME560602HSPGRM09","EMILIO VEGA MARTINEZ","01131",0,3,1,0,20,0,"24DPT0009M",201317,"9",201303,201317,225,1138.3360000000009]
[null,"SAN LUIS POTOSI","VEML550517KBA","VEML550517MSPLRT04","LETICIA VELAZQUEZ MORALES","01131",0,3,1,0,20,0,"24DPT0009M",201317,"9",201303,201317,225,1407.76]
[null,"SAN LUIS POTOSI","VIMR530429552","VIMR530429MCLLDS02","ROXANA VELAZQUEZ PUENTE","01131",0,3,1,0,20,0,"24DPT0009M",201317,"9",201303,201317,225,1444.07]
[null,"SAN LUIS POTOSI","VIMR530429552","VIMR530429MCLLDS02","ROSA ALICIA VILLEGAS  MEDELLIN","01131",0,3,1,0,20,0,"24DPT0009M",201317,"9",201303,201317,225,1413.33]
[null,"SAN LUIS POTOSI","ZAHS690627LN1","ZAHS690627MSPVRC02","MARIA DEL SOCORRO ZAVALA  HERNANDEZ","01131",0,3,1,0,20,0,"24DPT0009M",201317,"9",201303,201317,225,1872.5599999999899]
[null,"SAN LUIS POTOSI","AUFA630503DX7","AUFA630503HSPGRL08","ALEJANDRO AGUILAR FERNANDEZ","01131",0,3,1,0,20,0,"24DPT0001U",201317,"9",201303,201317,225,851.83999999999992]
[null,"SAN LUIS POTOSI","AAEC701030QT9","AAEC701030MDFNSN09","MA. DEL CONSUELO ANASTACIO ESTEFES","01131",0,3,1,0,20,0,"24DPT0001U",201317,"9",201303,201317,225,1590.19]
[null,"SAN LUIS POTOSI","BAXY600213Q39","BAXY600213MSPRXL06","YOLANDA BARRIOS N/A","01131",0,3,1,0,20,0,"24DPT0001U",201317,"9",201303,201317,225,1791.15]
[null,"SAN LUIS POTOSI","BAMS641103QN1","BAMS641103MSPRNL09","SILVIA ELENA BARRIOS MENDOZA","01131",0,3,1,0,20,0,"24DPT0001U",201317,"9",201303,201317,225,1697.88]
[null,"SAN LUIS POTOSI","CAPR6201295A2","CAPR620129HSPMDB06","RUBEN CAMACHO PADRON","01131",0,3,1,0,20,0,"24DPT0001U",201317,"9",201303,201317,225,1544.44]
[null,"SAN LUIS POTOSI","CARM5007227Y1","CARM500722MSPMGR08","MARTHA EUGENIA CAMACHO  REGALADO","01131",0,3,1,0,20,0,"24DPT0001U",201317,"9",201303,201317,225,1859.92]
[null,"SAN LUIS POTOSI","CAAP651030TB8","CAAP651030MSPSVT05","PETRA CASTILLO  AVILA","01131",0,3,1,0,20,0,"24DPT0001U",201317,"9",201303,201317,225,1481.28]
[null,"SAN LUIS POTOSI","CEJG7106259P4","CEJG710625HSPRML04","GUILLERMO CERVANTES JIMENEZ","01131",0,3,1,0,20,0,"24DPT0001U",201317,"9",201303,201317,225,1711.23]
[null,"SAN LUIS POTOSI","COLL581114DC8","COLL581114MSPMPS09","MA. LUISA COMPEAN LOPEZ","01131",0,3,1,0,20,0,"24DPT0001U",201317,"9",201303,201317,225,1850.74]
[null,"SAN LUIS POTOSI","COCE520817DA6","COCE520817MSPRSL06","MA. ELENA CORDOVA CASTILLO","01131",0,3,1,0,20,0,"24DPT0001U",201317,"9",201303,201317,225,1870.6200000000001]
[null,"SAN LUIS POTOSI","COHJ580113A73","COHJ580113MMCRRN07","JUANA EVA CORDOVA HERNANDEZ","01131",0,3,1,0,20,0,"24DPT0001U",201317,"9",201303,201317,225,1864.1]
[null,"SAN LUIS POTOSI","COMR481210UL6","COMR481210MSPVNY01","REYNA COVARRUBIAS MENDOZA","01131",0,3,1,0,20,0,"24DPT0001U",201317,"9",201303,201317,225,1870.6200000000001]
[null,"SAN LUIS POTOSI","CUFM730703JL2","CUFM730703HSPNNR00","MARCO ANTONIO CUENDIA FUENTES","01131",0,3,1,0,20,0,"24DPT0001U",201317,"9",201303,201317,225,1509.0600000000002]
[null,"SAN LUIS POTOSI","TEAE760114MP3","TEAE760114MSPJRT07","ETNA CLEOTILDE DE LA TEJA ARVIZU","01131",0,3,1,0,20,0,"24DPT0001U",201317,"9",201303,201317,225,996.98]
[null,"SAN LUIS POTOSI","DERA630916TV7","DERA630916MSLLDL09","MARIA ALICIA DELGADO  RODRIGUEZ","01131",0,3,1,0,20,0,"24DPT0001U",201317,"9",201303,201317,225,1892.77]
[null,"SAN LUIS POTOSI","EARE6710027E0","EARE671002MSPSNS06","ESTHER ESCALANTE RANGEL","01131",0,3,1,0,20,0,"24DPT0001U",201317,"9",201303,201317,225,1298.77]
[null,"SAN LUIS POTOSI","EAVJ7402025Q6","EAVJ740202HSPSRN00","JUAN PATRICIO ESCAMILLA VARGAS","01131",0,3,1,0,20,0,"24DPT0001U",201317,"9",201303,201317,225,1608.14]
[null,"SAN LUIS POTOSI","FEIA650129TV7","FEIA650129HSPRZQ03","AQUILES FERNANDEZ IZAGUIRRE","01131",0,3,1,0,20,0,"24DPT0001U",201317,"9",201303,201317,225,1870.3000000000002]
[null,"SAN LUIS POTOSI","FOBG800614EZ4","FOBG800614MSPLRS06","GISELA FLORES BARRIENTOS","01131",0,3,1,0,20,0,"24DPT0001U",201317,"9",201303,201317,225,1298.2900000000002]
[null,"SAN LUIS POTOSI","GAAL650815RR2","GAAL650815MSPLMR09","LAURA GALLARDO DEL ANGEL","01131",0,3,1,0,20,0,"24DPT0001U",201317,"9",201303,201317,225,1916.83]
[null,"SAN LUIS POTOSI","GACA680719NP9","GACA680719MSPLSN09","ANA DELIA GALLEGOS CASTAÑEDA","01131",0,3,1,0,20,0,"24DPT0001U",201317,"9",201303,201317,225,1863.65]
[null,"SAN LUIS POTOSI","GAOH7907028M8","GAOH790702HSPRRC04","HECTOR LUIS GARCIA  ORTEGA","01131",0,3,1,0,20,0,"24DPT0001U",201317,"9",201303,201317,225,1600.24]
[null,"SAN LUIS POTOSI","GOFL680327B85","GOFL680327MSPNLT04","LETICIA GONZALEZ FLORES","01131",0,3,1,0,20,0,"24DPT0001U",201317,"9",201303,201317,225,1665]
[null,"SAN LUIS POTOSI","GOHI7107157V2","GOHI710715MTSNRX03","IXCHEL GONZALEZ HERNANDEZ","01131",0,3,1,0,20,0,"24DPT0001U",201317,"9",201303,201317,225,1799.3600000000001]
[null,"SAN LUIS POTOSI","GUMR700301CP1","GUMR700301MSPRNS09","ROSA MARIA GUERRERO MENDOZA","01131",0,3,1,0,20,0,"24DPT0001U",201317,"9",201303,201317,225,1668.8600000000001]
[null,"SAN LUIS POTOSI","GUMI730706SB1","GUMI730706HSPRNS01","ISAIAS GUERRERO MONZON","01131",0,3,1,0,20,0,"24DPT0001U",201317,"9",201303,201317,225,1196.23]
[null,"SAN LUIS POTOSI","HEGG780128EM4","HEGG780128MDFRNS09","GISELA BEATRIZ HERNANDEZ  GONZALEZ","01131",0,3,1,0,20,0,"24DPT0001U",201317,"9",201303,201317,225,65.599999999999994]
[null,"SAN LUIS POTOSI","HEZN6209238G4","HEZN620923MTSRVR07","NORA ELVA HERNANDEZ  ZAVALA","01131",0,3,1,0,20,0,"24DPT0001U",201317,"9",201303,201317,225,1573.28]
[null,"SAN LUIS POTOSI","HENF580407SM5","HENF580407MTSRTT02","MA. DE FATIMA HERRERA NIETO","01131",0,3,1,0,20,0,"24DPT0001U",201317,"9",201303,201317,225,1562.42]
[null,"SAN LUIS POTOSI","IAAV7612233Z6","IAAV761223HSPZRC06","VICTOR MANUEL IZAGUIRRE ARELLANO","01131",0,3,1,0,20,0,"24DPT0001U",201317,"9",201303,201317,225,1608.92]
[null,"SAN LUIS POTOSI","IACN720128FT9","IACN720128MTSZRL07","NELLY ROSINA IZAGUIRRE CARDENAS","01131",0,3,1,0,12,0,"24DPT0001U",201317,"9",201303,201317,225,1038.71]
[null,"SAN LUIS POTOSI","LIVJ720505VE3","LIVJ720505HTSMLR07","JORGE ALBERTO LIMON VILLANUEVA","01131",0,3,1,0,20,0,"24DPT0001U",201317,"9",201303,201317,225,1610.7]
[null,"SAN LUIS POTOSI","LOMJ711030F60","LOMJ711030HSPPYN03","JUAN MARTIN LOPEZ MAYORGA","01131",0,3,1,0,20,0,"24DPT0001U",201317,"9",201303,201317,225,1723.45]
[null,"SAN LUIS POTOSI","MACI651102HW7","MACI651102MSPRSM05","IMELDA MARQUEZ CISNEROS","01131",0,3,1,0,20,0,"24DPT0001U",201317,"9",201303,201317,225,1819.76]
[null,"SAN LUIS POTOSI","MARJ770923516","MARJ770923HSPTML00","JULIO CESAR MATEOS ROMERO","01131",0,3,1,0,20,0,"24DPT0001U",201317,"9",201303,201317,225,1629.68]
[null,"SAN LUIS POTOSI","MEAE5511093F3","MEAE551109HSPNBS06","EUSTOLIO MENDEZ ABAT","01131",0,3,1,0,20,0,"24DPT0001U",201317,"9",201303,201317,225,1859.68]
[null,"SAN LUIS POTOSI","MORN691121QC4","MORN691121MSPCMR06","NORMA MOCTEZUMA RAMIREZ","01131",0,3,1,0,20,0,"24DPT0001U",201317,"9",201303,201317,225,1856.27]
[null,"SAN LUIS POTOSI","MOCA671120BJ1","MOCA671120MSPNSD04","ADELA MONROY CASTILLO","01131",0,3,1,0,20,0,"24DPT0001U",201317,"9",201303,201317,225,1150.8]
[null,"SAN LUIS POTOSI","MOVG651124QZ2","MOVG651124MTSRZD06","MA. GUADALUPE MORALES VAZQUEZ","01131",0,3,1,0,16,0,"24DPT0001U",201317,"9",201303,201317,225,954.34999999999991]
[null,"SAN LUIS POTOSI","MOVF710710888","MOVF710710HVZRLR00","FRANCISCO JAVIER MORALES VELAZQUEZ","01131",0,3,1,0,20,0,"24DPT0001U",201317,"9",201303,201317,225,1702.23]
[null,"SAN LUIS POTOSI","MUCE500527AZA","MUCE500527MSPNRS08","ESTHER MUNGUIA CERVANTES","01131",0,3,1,0,20,0,"24DPT0001U",201317,"9",201303,201317,225,213.21999999999997]
[null,"SAN LUIS POTOSI","MUMI6502099Y1","MUMI650209MPLXRR03","IRMA MUÑOZ MORALES","01131",0,3,1,0,20,0,"24DPT0001U",201317,"9",201303,201317,225,1564.4]
[null,"SAN LUIS POTOSI","MURR701108HU7","MURR701108HSPXLG05","ROGELIO MUÑOZ RAMIREZ","01131",0,3,1,0,20,0,"24DPT0001U",201317,"9",201303,201317,225,802.33999999999992]
[null,"SAN LUIS POTOSI","OEMA640824146","OEMA640824MSPRRR09","AUREA ORTEGA MARTINEZ","01131",0,3,1,0,20,0,"24DPT0001U",201317,"9",201303,201317,225,1058.22]
[null,"SAN LUIS POTOSI","PAGA641218772","PAGA641218HSPTRG09","AGRACIANO PAITA GARCIA","01131",0,3,1,0,20,0,"24DPT0001U",201317,"9",201303,201317,225,1742.9399999999998]
[null,"SAN LUIS POTOSI","POLA651003BG8","POLA651003MVZRRL02","ALMA DELIA PORTILLA LARA","01131",0,3,1,0,20,0,"24DPT0001U",201317,"9",201303,201317,225,1090.7]
[null,"SAN LUIS POTOSI","POLG541025AQ5","POLG541025MSPZRD06","MARIA GUADALUPE POZOS LARRAGA","01131",0,3,1,0,20,0,"24DPT0001U",201317,"9",201303,201317,225,1864.7]
[null,"SAN LUIS POTOSI","RAMP610701DI8","RAMP610701HMCMRB04","PABLO RAMIREZ MARTINEZ","01131",0,3,1,0,20,0,"24DPT0001U",201317,"9",201303,201317,225,1438.65]
[null,"SAN LUIS POTOSI","RAMC620706QN2","RAMC620706HSPMDS09","CESAREO RAMIREZ MEDINA","01131",0,3,1,0,20,0,"24DPT0001U",201317,"9",201303,201317,225,1678.0800000000002]
[null,"SAN LUIS POTOSI","RUAF651010QR4","RUAF651010MSPBLR05","FRANCISCA RUBIO ALMARAZ","01131",0,3,1,0,20,0,"24DPT0001U",201317,"9",201303,201317,225,1424.75]
[null,"SAN LUIS POTOSI","RUAJ780917EP9","RUAJ780917HSPBRN09","JUAN JESUS RUBIO ARTEAGA","01131",0,3,1,0,20,0,"24DPT0001U",201317,"9",201303,201317,225,1611.94]
[null,"SAN LUIS POTOSI","RURL781116QJ9","RURL781116MSPZJN07","LEONOR ORLEM RUIZ  ROJAS","01131",0,3,1,0,20,0,"24DPT0001U",201317,"9",201303,201317,225,1629.96]
[null,"SAN LUIS POTOSI","SAPE711122AK5","SAPE711122HSPMLL00","ELOI SAMANO PONCE","01131",0,3,1,0,20,0,"24DPT0001U",201317,"9",201303,201317,225,1432.34]
[null,"SAN LUIS POTOSI","SAPP700212N85","SAPP700212HSPMNDO8","PEDRO SAMANO PONCE","01131",0,3,1,0,20,0,"24DPT0001U",201317,"9",201303,201317,225,1422.48]
[null,"SAN LUIS POTOSI","SOLD660417GY5","SOLD660417MSPTNR02","DORA SILVIA SOTO DE LEON","01131",0,3,1,0,20,0,"24DPT0001U",201317,"9",201303,201317,225,1824.49]
[null,"SAN LUIS POTOSI","TOCM570613U68","TOCM570613MSPRRR08","MARICELA TORRES CRUZ","01131",0,3,1,0,20,0,"24DPT0001U",201317,"9",201303,201317,225,1505.74]
[null,"SAN LUIS POTOSI","TOMS6209162B5","TOMS620916MSPRCN03","SANDRA LUZ TORRES MOCTEZUMA","01131",0,3,1,0,20,0,"24DPT0001U",201317,"9",201303,201317,225,1546.0800000000002]
[null,"SAN LUIS POTOSI","TORP620614DL8","TORP620614MTSRMT07","MARIA PATRICIA TORRES ROMERO","01131",0,3,1,0,20,0,"24DPT0001U",201317,"9",201303,201317,225,1642.05]
[null,"SAN LUIS POTOSI","TONE7403103J6","TONE740310HSPVTL06","ELICER TOVAR NIETO","01131",0,3,1,0,20,0,"24DPT0001U",201317,"9",201303,201317,225,1544.25]
[null,"SAN LUIS POTOSI","TEGD790912B79","TEGD790912MSPRNL09","DULCE MARIA TREJO GONZALEZ","01131",0,3,1,0,20,0,"24DPT0001U",201317,"9",201303,201317,225,1562.65]
[null,"SAN LUIS POTOSI","TEOG570214T8A","TEOG570214HSPRCR06","GERARDO VALENTIN TREVIÑO OCEJO","01131",0,3,1,0,20,0,"24DPT0001U",201317,"9",201303,201317,225,1371.77]
[null,"SAN LUIS POTOSI","VAPM690514RM6","VAPM690514MSPRRR03","MIREYA VAZQUEZ PIZAÑO","01131",0,3,1,0,20,0,"24DPT0001U",201317,"9",201303,201317,225,1658.3000000000002]
[null,"SAN LUIS POTOSI","VINJ740730LS5","VINJ740730MSPTYL00","JULIETA VITALES NOYOLA","01131",0,3,1,0,20,0,"24DPT0001U",201317,"9",201303,201317,225,1682.61]
[null,"SAN LUIS POTOSI","ZAEN580910A82","ZAEN580910HSPMLC05","NICOLAS FLORENTINO ZAMORA ELENA","01131",0,3,1,0,20,0,"24DPT0001U",201317,"9",201303,201317,225,1844.24]
[null,"SAN LUIS POTOSI","CARH7709011FA","CARH770901HDFMYC01","CAMACHO REY HECTOR FELIPE","01131",0,3,1,0,10,0,"24DPT0003S",201317,"9",201303,201317,225,654.36000000000399]
[null,"SAN LUIS POTOSI","CAOG7903238I0","CAOG790323HSPSRS18","CASTILLO ORTIZ GUSTAVO LEONEL","01131",0,3,1,0,20,0,"24DPT0003S",201317,"9",201303,201317,225,1543.34]
[null,"SAN LUIS POTOSI","CORJ781225526","CORJ781225MSPNTS08","CONTRERAS RETA JESSICA ELIZABETH","01131",0,3,1,0,20,0,"24DPT0003S",201317,"9",201303,201317,225,1281.0899999999899]
[null,"SAN LUIS POTOSI","EAMT6110155X2","EAMT611015MSPSRR06","ESTRADA MORALES TERESA DE JESUS","01131",0,3,1,0,20,0,"24DPT0003S",201317,"9",201303,201317,225,1541.84]
[null,"SAN LUIS POTOSI","GOZF841127IC0","GOZF841127HSPNPR08","GONZALEZ ZAPATA FRANCISCO JAVIER","01131",0,3,1,0,20,0,"24DPT0003S",201317,"9",201303,201317,225,1452.53000000001]
[null,"SAN LUIS POTOSI","LOCJ6708117Q7","LOCJ670811HSPPHR01","LOPEZ CHAVEZ JORGE LUIS","01131",0,3,1,0,20,0,"24DPT0003S",201317,"9",201303,201317,225,1607.9899999999998]
[null,"SAN LUIS POTOSI","REAI771031CL0","REAI771031HSPYRS09","REYES ARZOLA ISAAC","01131",0,3,1,0,20,0,"24DPT0003S",201317,"9",201303,201317,225,1294.25]
[null,"SAN LUIS POTOSI","REMY780416J54","REMY780416MCLYNM02","REYES MENDOZA MARIA YAMINA","01131",0,3,1,0,20,0,"24DPT0003S",201317,"9",201303,201317,225,1280.73]
[null,"SAN LUIS POTOSI","SARM630502EA7","SARM630502HSPNNR08","SANDOVAL RANGEL MARTIN","01131",0,3,1,0,20,0,"24DPT0003S",201317,"9",201303,201317,225,1191.3000000000002]
[null,"SAN LUIS POTOSI","VILC750206FG0","VILC750206MSPLLR05","VILLANUEVA LLANAS MARIA DEL CARMEN","01131",0,3,1,0,20,0,"24DPT0003S",201317,"9",201303,201317,225,1473.27]
[null,"SAN LUIS POTOSI","CAVS630617M45","CAVS630617MSPSLL08","CASTILLEJA VALADEZ SILVIA LEONOR","01131",0,3,1,0,20,0,"24DPT0003S",201317,"9",201303,201317,225,1654.29000000001]
[null,"SAN LUIS POTOSI","GASG740126UU3","GASG740126MSPRLD05","GARAY SILVA MARIA GUADALUPE","01131",0,3,1,0,20,0,"24DPT0003S",201317,"9",201303,201317,225,1700.5100000000102]
[null,"SAN LUIS POTOSI","HERA661026EM8","HERA661026HSPRYL02","HERNANDEZ REYNA ALEJANDRO","01131",0,3,1,0,20,0,"24DPT0003S",201317,"9",201303,201317,225,1713.5600000000102]
[null,"SAN LUIS POTOSI","ROGG670204618","ROGG670204HSPDRL07","RODRIGUEZ GARCIA GILBERTO","01131",0,3,1,0,20,0,"24DPT0003S",201317,"9",201303,201317,225,1657.0300000000198]
[null,"SAN LUIS POTOSI","TOFR8004283Q6","TOFR800428MSPRCB01","TORRES FACUNDO MARIA REBECA","01131",0,3,1,0,20,0,"24DPT0003S",201317,"9",201303,201317,225,1176.78]
[null,"SAN LUIS POTOSI","BIGC730914SF1","BIGC730914MSPRTR09","BRIONES GUTIERREZ CAROLINA DEL CARMEN","01131",0,3,1,0,20,0,"24DPT0003S",201317,"9",201303,201317,225,1936.2599999999998]
[null,"SAN LUIS POTOSI","GAOJ710130EIA","GAOJ710130HTSRRS06","GARZA ORTEGA JESUS ALBERTO","01131",0,3,1,0,20,0,"24DPT0003S",201317,"9",201303,201317,225,1928.8000000000097]
[null,"SAN LUIS POTOSI","GOTA72072926A","GOTA720729HSPNRB00","GONZALEZ TRISTAN ABEL ORLANDO","01131",0,3,1,0,20,0,"24DPT0003S",201317,"9",201303,201317,225,1915.1]
[null,"SAN LUIS POTOSI","HEGF671112HE5","HEGF671112HSPRNR08","HERNANDEZ GONZALEZ FRANCISCO","01131",0,3,1,0,20,0,"24DPT0003S",201317,"9",201303,201317,225,1740.1000000000099]
[null,"SAN LUIS POTOSI","HERE720801RM4","HERE720801MSPRYS05","HERNANDEZ REYNA MARIA ESPERANZA","01131",0,3,1,0,20,0,"24DPT0003S",201317,"9",201303,201317,225,1935.3300000000099]
[null,"SAN LUIS POTOSI","LOOI630403PR0","LOOI630403HSPRBS07","LOREDO OBREGON ISRAEL","01131",0,3,1,0,20,0,"24DPT0003S",201317,"9",201303,201317,225,1413.0719999999999]
[null,"SAN LUIS POTOSI","MERA670804NV8","MERA670804HSPDNL04","MEDELLIN RANGEL ALEJO","01131",0,3,1,0,10,0,"24DPT0003S",201317,"9",201303,201317,225,1816.74999999999]
[null,"SAN LUIS POTOSI","PECR760307GI7","PECR760307MSPXRS06","PEÑA CAREAGA ROSALBA","01131",0,3,1,0,6,0,"24DPT0003S",201317,"9",201303,201317,225,424.62999999999897]
[null,"SAN LUIS POTOSI","RALI650814RIA","RALI650814HSPNRS08","RANGEL LOERA ISMAEL","01131",0,3,1,0,20,0,"24DPT0003S",201317,"9",201303,201317,225,1818.93]
[null,"SAN LUIS POTOSI","RECJ630208ND7","RECJ630208HSPYRV06","REYNA CARDENAS JUVENCIO","01131",0,3,1,0,20,0,"24DPT0003S",201317,"9",201303,201317,225,1823.97999999999]
[null,"SAN LUIS POTOSI","ROGH6205024I0","ROGH620502HSPCTC06","ROCHA GAITAN HECTOR","01131",0,3,1,0,20,0,"24DPT0003S",201317,"9",201303,201317,225,1696.55000000001]
[null,"SAN LUIS POTOSI","ROAR640809MVA","ROAR640809MSPDLM06","RODRIGUEZ ALVARADO ROMANA","01131",0,3,1,0,20,0,"24DPT0003S",201317,"9",201303,201317,225,1951.6300000000099]
[null,"SAN LUIS POTOSI","ROAT681015HRO","ROAT681015MSPDLR08","RODRIGUEZ ALVISO TERESA DE JESUS","01131",0,3,1,0,20,0,"24DPT0003S",201317,"9",201303,201317,225,1730.8400000000099]
[null,"SAN LUIS POTOSI","ROBA710121429","ROBA710121MSPDRL09","RODRIGUEZ BARRON ALMA ROSA","01131",0,3,1,0,20,0,"24DPT0003S",201317,"9",201303,201317,225,1915.2000000000103]
[null,"SAN LUIS POTOSI","ROCE701105KU1","ROCE701105MSPDRL08","RODRIGUEZ CERDA ELSA","01131",0,3,1,0,20,0,"24DPT0003S",201317,"9",201303,201317,225,1738.41]
[null,"SAN LUIS POTOSI","RUCH5602237U6","RUCH560223HSPDRC07","RUEDA CARMONA HECTOR MANUEL","01131",0,3,1,0,20,0,"24DPT0003S",201317,"9",201303,201317,225,1929.0799999999902]
[null,"SAN LUIS POTOSI","TONS750716RT0","TONS750716MCLRVL01","TORRES NAVA SILVIA ELIZABETH","01131",0,3,1,0,20,0,"24DPT0003S",201317,"9",201303,201317,225,1919.81]
[null,"SAN LUIS POTOSI","HETM840413SA8","HETM840413HSPRLS05","HERNANDEZ TELLO MOISES","01131",0,3,1,0,20,0,"24DPT0003S",201317,"9",201303,201317,225,1164.52000000001]
[null,"SAN LUIS POTOSI","LOVL781118RQ2","LOVL781118HSPPLS07","LOPEZ VELEZ LUIS ANGEL","01131",0,3,1,0,20,0,"24DPT0003S",201317,"9",201303,201317,225,1156.9700000000098]
[null,"SAN LUIS POTOSI","MUZF701029F18","MUZF701029HSPXPD07","MUÑOZ ZAPATA FEDERICO","01131",0,3,1,0,20,0,"24DPT0003S",201317,"9",201303,201317,225,1098.5999999999999]
[null,"SAN LUIS POTOSI","AURW7711233I3","AURW771123MSPGYN07","AGUILAR REYES WENDY GUADALUPE","01131",0,3,1,0,20,0,"24DPT0007O",201317,"9",201303,201317,225,1683.52]
[null,"SAN LUIS POTOSI","AACL421108AB7","AACL421108HSPLBN03","ALANIS CABRERA LENIN ARNULFO","01131",0,3,1,0,20,0,"24DPT0007O",201317,"9",201303,201317,225,1906.64]
[null,"SAN LUIS POTOSI","AACC6407247EA","AACC640724HSPRNT02","ARANDA CONTRERAS CUITLAHUAC","01131",0,3,1,0,20,0,"24DPT0007O",201317,"9",201303,201317,225,-71.099999999999994]
[null,"SAN LUIS POTOSI","CEAS560904313","CEAS560904HCMRVN09","CERNAS AVALOS SANTIAGO","01131",0,3,1,0,20,0,"24DPT0007O",201317,"9",201303,201317,225,1644.88]
[null,"SAN LUIS POTOSI","CORD851103291","CORD851103MSPRMF01","CORPUS RAMIREZ DAFNE SILVANA","01131",0,3,1,0,18,0,"24DPT0007O",201317,"9",201303,201317,225,-66.61]
[null,"SAN LUIS POTOSI","COCR820311651","COCR820311HSPRNC04","CORTEZ CONTRERAS RICARDO ROLANDO","01131",0,3,1,0,20,0,"24DPT0007O",201317,"9",201303,201317,225,1448.28]
[null,"SAN LUIS POTOSI","CURJ7011068Y1","CURJ701106HSPRVV00","CRUZ RIVERA JAVIER LEONARDO","01131",0,3,1,0,20,0,"24DPT0007O",201317,"9",201303,201317,225,1903.14]
[null,"SAN LUIS POTOSI","CUHA760315EI9","CUHA760315HSPLRN00","CUELLAR HUERTA JOSE ANTONIO","01131",0,3,1,0,10,0,"24DPT0007O",201317,"9",201303,201317,225,701.42000000000007]
[null,"SAN LUIS POTOSI","DAPM8512312R5","DAPM851231HSPVZR07","DAVALOS PAEZ MARCO ANTONIO","01131",0,3,1,0,18,0,"24DPT0007O",201317,"9",201303,201317,225,-65.42]
[null,"SAN LUIS POTOSI","EALM760403GUA","EALM760403HZSSYN09","ESPARZA LEYVA JOSE MANUEL","01131",0,3,1,0,20,0,"24DPT0007O",201317,"9",201303,201317,225,1431.57]
[null,"SAN LUIS POTOSI","GAME760915HS9","GAME760915MSPLDN02","GALLARDO MEDINA EMMA NOELIA","01131",0,3,1,0,20,0,"24DPT0007O",201317,"9",201303,201317,225,-65.56]
[null,"SAN LUIS POTOSI","FOHL830720SP9","FOHL830720HSPLRS01","FLORES HERNANDEZ LUIS ENRIQUE","01131",0,3,1,0,20,0,"24DPT0007O",201317,"9",201303,201317,225,-85.25]
[null,"SAN LUIS POTOSI","FOHM790707DH8","FOHM790707MSPLRN07","FLORES HERNANDEZ MONICA JAZMIN","01131",0,3,1,0,20,0,"24DPT0007O",201317,"9",201303,201317,225,1906.8700000000001]
[null,"SAN LUIS POTOSI","GAEG850702RC1","GAEG850702MSPYSV04","GAYTAN ESQUIVEL GIOVANNA DENNISE","01131",0,3,1,0,20,0,"24DPT0007O",201317,"9",201303,201317,225,-68.099999999999994]
[null,"SAN LUIS POTOSI","GOCE870717B66","GOCE870717MSPNSR02","GONZALEZ CISNEROS ERIKA DEYADIRA","01131",0,3,1,0,15,0,"24DPT0007O",201317,"9",201303,201317,225,-68.259999999999991]
[null,"SAN LUIS POTOSI","GODK860424TX9","GODK860424MSPNZR01","GONZALEZ DIAZ KARLA BEATRIZ","01131",0,3,1,0,20,0,"24DPT0007O",201317,"9",201303,201317,225,-64.829999999999984]
[null,"SAN LUIS POTOSI","GOGM750520AD8","GOGM750520HSPNRR07","GONZALEZ GUERRA MARCO TULIO","01131",0,3,1,0,20,0,"24DPT0007O",201317,"9",201303,201317,225,1912.6200000000001]
[null,"SAN LUIS POTOSI","GUDO5512047FO","GUDO551204MTSRZT03","GUERRA DIAZ OTILIA ELIZABETH","01131",0,3,1,0,20,0,"24DPT0007O",201317,"9",201303,201317,225,1906.64]
[null,"SAN LUIS POTOSI","HECA810404QG4","HECA810404HSPRBL07","HERNANDEZ CABRERA ALAIN ALBERTO","01131",0,3,1,0,20,0,"24DPT0007O",201317,"9",201303,201317,225,0]
[null,"SAN LUIS POTOSI","JAAA7312072T4","JAAA731207HSPCCM05","JACOBO ACEVEDO AMBROSIO","01131",0,3,1,0,20,0,"24DPT0007O",201317,"9",201303,201317,225,1461.24]
[null,"SAN LUIS POTOSI","JACA790718KPA","JACA790718MSPCRN06","JACOBO CORONADO ANA MIRIAM","01131",0,3,1,0,20,0,"24DPT0007O",201317,"9",201303,201317,225,-67.39]
[null,"SAN LUIS POTOSI","LEGA500601HSP","LEGA500601HSPZRL09","LEZAMA GARCIA ALFONSO","01131",0,3,1,0,8,0,"24DPT0007O",201317,"9",201303,201317,225,-26.380000000000003]
[null,"SAN LUIS POTOSI","LOAJ8607033W0","LOAJ860703HSPPVN06","LOPEZ AVILA JUAN DAVID","01131",0,3,1,0,20,0,"24DPT0007O",201317,"9",201303,201317,225,-52.500000000000007]
[null,"SAN LUIS POTOSI","LOCR5807107Q5","LOCR580710HSPPSF08","LOPEZ CASTILLO RAFAEL","01131",0,3,1,0,20,0,"24DPT0007O",201317,"9",201303,201317,225,1644.88]
[null,"SAN LUIS POTOSI","MALR751018G42","MALR751018MPLRPQ02","MARTINEZ LOPEZ RAQUEL","01131",0,3,1,0,19,0,"24DPT0007O",201317,"9",201303,201317,225,-60.669999999999995]
[null,"SAN LUIS POTOSI","MARS590126IL8","MARS590126MSPROL09","MARTINEZ RODRIGUEZ SILVIA","01131",0,3,1,0,20,0,"24DPT0007O",201317,"9",201303,201317,225,1461.31]
[null,"SAN LUIS POTOSI","MATJ820624PE6","MATJ820624HSPRRN11","MARTINEZ TORRES JUAN MANUEL","01131",0,3,1,0,20,0,"24DPT0007O",201317,"9",201303,201317,225,1452.8999999999999]
[null,"SAN LUIS POTOSI","MEMM7906135N1","MEMM790613HSPLRN13","MELCHOR MORENO JOSE MANUEL","01131",0,3,1,0,20,0,"24DPT0007O",201317,"9",201303,201317,225,1636.5100000000002]
[null,"SAN LUIS POTOSI","MEPH760604A24","MEPH760604HDFNRC07","MENDOZA PEREZ HECTOR ALEJANDRO","01131",0,3,1,0,20,0,"24DPT0007O",201317,"9",201303,201317,225,1428.6499999999999]
[null,"SAN LUIS POTOSI","MEPJ741216UT6","MEPJ741216HDFNRR09","MENDOZA PEREZ JORGE ALBERTO","01131",0,3,1,0,20,0,"24DPT0007O",201317,"9",201303,201317,225,1455.96]
[null,"SAN LUIS POTOSI","MOGL751224U33","MOGL751224MSPRLR02","MORALES GALICIA MA. DE LOURDES","01131",0,3,1,0,14,0,"24DPT0007O",201317,"9",201303,201317,225,-49.61]
[null,"SAN LUIS POTOSI","MUGP870205AV5","MUGP870205MSPXMM02","MUÑIZ GOMEZ PAMELA","01131",0,3,1,0,19,0,"24DPT0007O",201317,"9",201303,201317,225,-81.77000000000001]
[null,"SAN LUIS POTOSI","PETL610331JG9","PETL610331HSPRRS06","PEREZ TERAN JOSE LUIS","01131",0,3,1,0,16,0,"24DPT0007O",201317,"9",201303,201317,225,-67.290000000000006]
[null,"SAN LUIS POTOSI","NASG680512QM4","NASG680512HSPRNL01","NARVAEZ SANCHEZ GUILLERMO","01131",0,3,1,0,20,0,"24DPT0007O",201317,"9",201303,201317,225,1894.2800000000002]
[null,"SAN LUIS POTOSI","NASP620425RH3","NASP620425HSPVSD03","NAVARRETE SOSA PEDRO ANTONIO","01131",0,3,1,0,16,0,"24DPT0007O",201317,"9",201303,201317,225,-63.180000000000007]
[null,"SAN LUIS POTOSI","OAGV7608069K8","OAGV760806HSPXRC03","OÑATE GARCIA JOSE VICTOR","01131",0,3,1,0,20,0,"24DPT0007O",201317,"9",201303,201317,225,1631.94]
[null,"SAN LUIS POTOSI","PEMT680208272","PEMT680208MSPXZR07","PEÑA DE LA MAZA MARIA TERESA DE JESUS","01131",0,3,1,0,20,0,"24DPT0007O",201317,"9",201303,201317,225,1900.12]
[null,"SAN LUIS POTOSI","PEMA781108LS3","PEMA781108MSPRXN05","PEREZ MUÑIZ ANA LUISA","01131",0,3,1,0,20,0,"24DPT0007O",201317,"9",201303,201317,225,1457.62]
[null,"SAN LUIS POTOSI","PEBD761216MQ9","PEBD761216MMCRRL02","PEREZ BRAVO DULCE MARIA","01131",0,3,1,0,20,0,"24DPT0007O",201317,"9",201303,201317,225,1455.25]
[null,"SAN LUIS POTOSI","PEGJ790701TZ6","PEGJ790701HASRNL07","PEREZ GONZALEZ JULIO CESAR","01131",0,3,1,0,20,0,"24DPT0007O",201317,"9",201303,201317,225,1423.31]
[null,"SAN LUIS POTOSI","VARN6802263L9","VARN680226HSPZMS07","VAZQUEZ RAMIREZ NASARIO","01131",0,3,1,0,18,0,"24DPT0007O",201317,"9",201303,201317,225,0]
[null,"SAN LUIS POTOSI","PETC6811049X1","PETC681104HSPRRR06","PEREZ TERAN CARLOS","01131",0,3,1,0,20,0,"24DPT0007O",201317,"9",201303,201317,225,1884.7]
[null,"SAN LUIS POTOSI","QUMM721121LP2","QUMM721121MSPNRR03","QUINTANILLA MARTINEZ MAURA REBECA","01131",0,3,1,0,20,0,"24DPT0007O",201317,"9",201303,201317,225,1898.96]
[null,"SAN LUIS POTOSI","RARL5606213B1","RARL560621HSPMNS06","RAMIREZ RINCON LUIS","01131",0,3,1,0,20,0,"24DPT0007O",201317,"9",201303,201317,225,1906.64]
[null,"SAN LUIS POTOSI","ROLA600205R52","ROLA600205MSPDPD01","RODRIGUEZ LOPEZ ADRIANA LETICIA","01131",0,3,1,0,20,0,"24DPT0007O",201317,"9",201303,201317,225,1444.05]
[null,"SAN LUIS POTOSI","TINA691007H57","TINA691007HSPRJR05","TIRADO NAJERA ARTURO","01131",0,3,1,0,20,0,"24DPT0007O",201317,"9",201303,201317,225,1916.42]
[null,"SAN LUIS POTOSI","TOZR761021T4A","TOZR761021HSPBCF09","TOBIAS ZACARIAS RAFAEL","01131",0,3,1,0,20,0,"24DPT0007O",201317,"9",201303,201317,225,1906.64]
[null,"SAN LUIS POTOSI","TOMI610123MF0","TOMI610123HSPVRL08","TOVAR MARTINEZ ILDEFONSO","01131",0,3,1,0,20,0,"24DPT0007O",201317,"9",201303,201317,225,1907.57]
[null,"SAN LUIS POTOSI","VERR770815LE8","VEER770815HSPRVY08","VERA REVELES RAYMUNDOJESUS","01131",0,3,1,0,20,0,"24DPT0007O",201317,"9",201303,201317,225,-334.87]
[null,"SAN LUIS POTOSI","VIRR820407UD6","VIRR820407HSPLDC07","VILLANUEVA RODRIGUEZ RICARDO AUGUSTO","01131",0,3,1,0,20,0,"24DPT0007O",201317,"9",201303,201317,225,-58.300000000000004]
[null,"SAN LUIS POTOSI","ZUVP7411101R4","ZUVP741110HSPXND04","ZUÑIGA VENTURA PEDRO","01131",0,3,1,0,20,0,"24DPT0007O",201317,"9",201303,201317,225,1476.54]
[]
[]
[]
[]
[null,"Total Personas : ",478," (153 PLAZAS DE PERSONAL ADMVO. Y 324 DOCENTES)",null,null,null,null,null,null,"Total Plazas : ",153,null,null,null,"Total Percepciones Pagadas:",null,null,{"$f":"SUBTOTAL(109,Tabla10[Percepciones pagadas en el periodo reportado *])","v":1238684.9039999994}]
[null,"NOTA 1: LOS TRABAJADORES ACADÉMICOS FUERON BASIFICADOS EN EL ESTADO, EL ESQUEMA DE PAGO ES MIXTO, YA QUE SE PAGAN 4715 HORAS SEMANA MES CON PRESUPUESTO FEDERAL (3288 HSM AL 100% Y 1427 AL 50%, ESTAS ÚLTIMAS CORRESPONDEN A INCREMENTOS A PARTIR DE LA FEDERALIZACIÓN), LAS DIFERENCIAS DE HORAS ASÍ COMO LAS PRESTACIONES DEL CONTRTATO COLECTIVO DE TRABAJO Y LA SEGURIDAD SOCIAL SE PAGA CON INGRESOS PROPIOS Y/O CON APORTACIÓN ESTATAL (VER FORMATO II D) 6)"]
[]
[]
[]
[null,"NOTA 2: PAGO RETROACTIVO DEL INCREMENTO SALARIAL DEL 3.9% AL PERSONAL DOCENTE, ADMINISTRATIVO TÉCNICO Y MANUAL (BASE Y CONFIANZA)  ( A PARTIR DEL 1° DE FEBRERO DEL 2013) Y 2.4% A LAS PRESTACIONES DEL PERSONAL ADMINISTRATIVO TÉCNICO Y MANUAL (BASE Y CONFIANZA)"]
[]
[null,"*Total de Percepciones reportadas por la Entidad Federativa como pagadas en el periodo "]
[null,"Fuente : Información proporcionada por las Entidades Federativas"]

{"sheet":"II B) Y 1","index":4,"n_rows":558,"n_cols":25,"rows_kept":558,"cut":false,"hidden":false,"merged":[[12,4,14,4],[12,3,14,3],[12,2,14,2],[9,1,9,9],[555,21,555,23],[12,1,14,1],[12,5,14,5],[12,24,14,24],[13,6,13,8],[13,9,13,11],[13,12,13,14],[13,15,13,17],[13,18,13,20],[12,6,12,20],[12,21,14,21],[12,22,14,22],[12,23,14,23]]}
[]
[]
[]
[]
[]
[]
[]
[]
[null,"Formato: Plaza / Función"]
[null,{"$f":"IF('Caratula Resumen'!D22=\"Elige el Periodo…\",\"\",'Caratula Resumen'!D22)","v":"Fondo de Aportaciones para la Educación Tecnológica y de Adultos/Colegio Nacional de Educación Profesional Técnica (FAETA/CONALEP)"},null,null,null,null,null,null,null,null,null,null,null,null,null,null,null,null,null,null,null,null,null,{"$f":"IF('Caratula Resumen'!D23=\"Elige el Periodo…\",\"\",'Caratula Resumen'!D23)","v":"3er. Trimestre"}]
[]
[]
[null,"Entidad Federativa","RFC","CURP","Nombre","Centros de Trabajo","Plazas por tipo de función",null,null,null,null,null,null,null,null,null,null,null,null,null,null,"Total plazas Jornada","Total \nHSM","Total de Honorarios","Total de recursos presupuestales ejercidos en servicios personales en el periodo\n(2)"]
[null,null,null,null,null,null,"Apoyo a la labor educativa",null,null,"Administrativo y de servicio",null,null,"Docente y Apoyo Técnico Pedagógico",null,null,"Directivos y Supervisión",null,null,"Mandos medios y superiores"]
[null,null,null,null,null,null,"Jornada","HSM","Honorarios","Jornada","HSM","Honorarios","Jornada","HSM","Honorarios","Jornada","HSM","Honorarios","Jornada","HSM","Honorarios"]
[]
[null,"Entidad Federativa","RFC","CURP","Nombre","Centros de Trabajo","Jornada","HSM","Honorarios","Jornada2","HSM3","Honorarios4","Jornada5","HSM6","Honorarios7","Jornada8","HSM9","Honorarios10","Jornada11","HSM12","Honorarios13","Total plazas Jornada","Total \nHSM","Total de Honorarios","Total de recursos presupuestales ejercidos en servicios personales en el periodo\n(2)"]
[null,"SAN LUIS POTOSI","AADJ710417P70","AADJ710417HSPLZM09","JAIME ALVAREZ DIAZ","24DPT0007O","","","",40,0,0,"","","","","","",null,"","",40,0,0,62345.500400000004]
[null,"SAN LUIS POTOSI","AAEV820708KG1","AAEV820708MSPLSN04","VIANEY ALVAREZ ESTRADA","24DPT0003S","","","",40,0,0,"","","","","","",null,"","",40,0,0,55066.248400000004]
[null,"SAN LUIS POTOSI","AAHR590313BP3","AAHR590313HSPLRM03","RAMIRO ALVARADO HERRERA","24DPT0003S","","","",40,0,0,"","","","","","",null,"","",40,0,0,74808.320900000006]
[null,"SAN LUIS POTOSI","AAMR760716SI1","AAMR760716MSPRLC06","ROCIO DEL CARMEN ARAUJO MELENDEZ","24DPT0009X","","","",null,null,null,"","","",40,0,0,null,"","",40,0,0,88275.55260000001]
[null,"SAN LUIS POTOSI","AARG670120NU4","AARG670120MSPLYD07","MA. GUADALUPE ALMAZAN REYES","24DPT0001U","","","",40,0,0,"","","","","","",null,"","",40,0,0,63253.157300000006]
[null,"SAN LUIS POTOSI","AELR680504JA6","AELR680504HSPLRM09","RAMIRO ALMENDARIZ LOREDO","24DPT0009M","","","",40,0,0,"","","","","","",null,"","",40,0,0,67092.69690000001]
[null,"SAN LUIS POTOSI","AEMJ710318GR8","AEMJ710318MSPRRS05","JOSEFINA ARREDONDO MORENO","24DPT0003S","","","",40,0,0,"","","","","","",null,"","",40,0,0,61807.097900000001]
[null,"SAN LUIS POTOSI","AOAB710714253","AOAB710714MDFLRN03","ALONSO ARROYO BUENAVENTURA","24DPT0005Q","","","",null,null,null,"","","","","","",40,0,0,40,0,0,66459.896999999997]
[null,"SAN LUIS POTOSI","AOAM760119SL9","AOAM760119MDFLRR09","MARIANA ALONSO ARROYO","24DPT0005Q","","","",40,0,0,"","","","","","",null,"","",40,0,0,46491.080500000004]
[null,"SAN LUIS POTOSI","AOCM540706DF7","AOCM540706HSPLVG04","MIGUEL AGUSTIN ALONSO CUEVAS","24DPT0005Q",40,0,0,null,null,null,"","","","","","",null,"","",40,0,0,43248.613700000002]
[null,"SAN LUIS POTOSI","BAAJ5701089W8","BAAJ570108HSPNNN02","JUAN FELIPE BANDA ANGUIANO","24DPT0007O","","","",40,0,0,"","","","","","",null,"","",40,0,0,37211.721000000005]
[null,"SAN LUIS POTOSI","BABD811223FSA","BABD811223MSPZNL05","MARIA DOLORES BAEZ BANDA","24DPT0005Q",40,0,0,null,null,null,"","","","","","",null,"","",40,0,0,36490.911500000002]
[null,"SAN LUIS POTOSI","BARG670418KM6","BARG670418MSPZMD01","MARIA GUADALUPE BAEZ RAMIREZ","24DPT0005Q","","","",40,0,0,"","","","","","",null,"","",40,0,0,70707.660499999998]
[null,"SAN LUIS POTOSI","BEOC791213PUG","BEOC791213HMCLRR05","CRHISTIAN ARTURO BELTRAN ORTEGA","24DPT0005Q","","","",40,0,0,"","","","","","",null,"","",40,0,0,40204.747300000003]
[null,"SAN LUIS POTOSI","CACM531122I50","CACM531122HSPMMG19","MIGUEL CAMPOS CAMBRANIS","24DPT0009X","","","",null,null,null,"","","","","","",40,0,0,40,0,0,236416.32]
[null,"SAN LUIS POTOSI","CADR541024LK1","CADR541024MSPSZS05","MA. DEL ROSARIO CASTILLO DIAZ","24DPT0001U",40,0,0,null,null,null,"","","","","","",null,"","",40,0,0,40936.534800000001]
[null,"SAN LUIS POTOSI","CAGX670227BG6","CXGA670227HSPSLR02","ARIEL SAN MARTIN CASTELLANOS GUILLEN","24DPT0009M","","","",null,null,null,"","","","","","",40,0,0,40,0,0,85992.471000000005]
[null,"SAN LUIS POTOSI","CAMF701124TC7","CAMF701124HSPBDR12","FERNANDO CABRIALES MEDELLIN","24DPT0005Q","","","",null,null,null,"","","",40,0,0,null,"","",40,0,0,96972.946300000011]
[null,"SAN LUIS POTOSI","CAMM550517IH3","CAMM550517HSPSRR03","MAURICIO CASTILLO MORALES","24DPT0001U","","","",40,0,0,"","","","","","",null,"","",40,0,0,38611.056700000001]
[null,"SAN LUIS POTOSI","CAPE7205048Y3","CAPE720504HSPHZR05","ERNESTO CHAVEZ POZOS","24DPT0001U",40,0,0,null,null,null,"","","","","","",null,"","",40,0,0,36454.891100000001]
[null,"SAN LUIS POTOSI","CARA7405111H3","CARA740511MNLSNN11","MA. DE LOS ANGEL CASTILLO RANGEL","24DPT0009X","","","",40,0,0,"","","","","","",null,"","",40,0,0,75764.277000000002]
[null,"SAN LUIS POTOSI","CARF660330CX6","CARF660330HSPMVL00","FELIPE DE JESUS CAMACHO RIVERA","24DPT0009M",40,0,0,null,null,null,"","","","","","",null,"","",40,0,0,39841.362000000001]
[null,"SAN LUIS POTOSI","CASE760707JF9","CASE760707MSPLFL01","ELVIA ESTHER CALDERON SAFA","24DPT0009X","","","",null,null,null,"","","",40,0,0,null,"","",40,0,0,93929.022600000011]
[null,"SAN LUIS POTOSI","CAVA5107243K4","CAVA510724HSPHRN05","JOSE A CHAVEZ VARGAS","24DPT0005Q","","","",null,null,null,"","","",40,0,0,null,"","",40,0,0,117465.90890000001]
[null,"SAN LUIS POTOSI","COMF5002232B2","COMF500223HDFLRL06","FELIPE COLLES MURGA","24DPT0005Q","","","",null,null,null,"","","",40,0,0,null,"","",40,0,0,86474.1198]
[null,"SAN LUIS POTOSI","DEGV660220PV1","DEGV660220MSPLNR02","VIRGINIA DELGADO GONZALEZ","24DPT0001U","","","",null,null,null,"","","",40,0,0,null,"","",40,0,0,108411.11450000001]
[null,"SAN LUIS POTOSI","DETL831214UV7","DETL831214HSPLRC04","LUCIO ISAAC DELGADO TORRES","24DPT0003S","","","",null,null,null,"","","","","","",40,0,0,40,0,0,66459.896999999997]
[null,"SAN LUIS POTOSI","DICA6803126P0","DICA680312MSPZNN03","MARIA ANITA DIAZ CONTRERAS","24DPT0005Q","","","",40,0,0,"","","","","","",null,"","",40,0,0,37416.685300000005]
[null,"SAN LUIS POTOSI","DIDG730222874","DIDG730222MTSZSB06","GABRIELA DIAZ DIOSDADO","24DPT0005Q","","","",null,null,null,"","","",40,0,0,null,"","",40,0,0,95854.946300000011]
[null,"SAN LUIS POTOSI","DIFA410704P57","DIFA410704MTSZLL01","ALICIA DIAZ FLORES","24DPT0009M","","","",40,0,0,"","","","","","",null,"","",40,0,0,5529.3534]
[null,"SAN LUIS POTOSI","DIRA831017RWA","DIRA831017HSPZML00","ALEJANDRO DIAZ RAMIREZ","24DPT0001U","","","",40,0,0,"","","","","","",null,"","",40,0,0,24295.473400000003]
[null,"SAN LUIS POTOSI","FIRE770703T35","FIRE770703HASGMR01","ERNESTO FIGUEROA ROMERO","24DPT0007O","","","",null,null,null,"","","","","","",40,0,0,40,0,0,66459.896999999997]
[null,"SAN LUIS POTOSI","FOHM651218DV0","FOHM651218HSPLRS09","MOISES FLORES HERNANDEZ","24DPT0001U","","","",null,null,null,"","","","","","",40,0,0,40,0,0,85992.471000000005]
[null,"SAN LUIS POTOSI","GAAF571004N86","GAAF571004HSPRRR07","FRANCISCO JAVIER GARCIA AREVALO","24DPT0009M","","","",40,0,0,"","","","","","",null,"","",40,0,0,39200.796500000004]
[null,"SAN LUIS POTOSI","GACA8606041K6","GACA860604HSPRSD08","ADRIAN GARCIA CASTILLO","24DPT0005Q","","","",40,0,0,"","","","","","",null,"","",40,0,0,2969.9745000000003]
[null,"SAN LUIS POTOSI","GAMV520122GS8","GAMV520122HSPRRC02","VICENTE GARCIA MORENO","24DPT0009M","","","",40,0,0,"","","","","","",null,"","",40,0,0,39892.914000000004]
[null,"SAN LUIS POTOSI","GARF5708239A8","GARF570823HSPLML02","JOSE FELIPE GALVAN RAMIREZ","24DPT0009M","","","",40,0,0,"","","","","","",null,"","",40,0,0,71869.108300000007]
[null,"SAN LUIS POTOSI","GAVR610904NB5","GAVR610904HSPYLN05","JOSE RENE GAYTAN VELAZQUEZ","24DPT0007O","","","",null,null,null,"","","",40,0,0,null,"","",40,0,0,93529.407800000001]
[null,"SAN LUIS POTOSI","GOFO750504S66","GOFO750504MSPNZR00","ORYANA VANESSA GONZALEZ FAZ","24DPT0005Q","","","",null,null,null,"","","",40,0,0,null,"","",40,0,0,98302.968399999998]
[null,"SAN LUIS POTOSI","GOLC801206QJ7","GOLC801206MSPNNL06","CLAUDIA MORENA GONZALEZ DE LEON","24DPT0001U","","","",40,0,0,"","","","","","",null,"","",40,0,0,33718.705999999998]
[null,"SAN LUIS POTOSI","GOME590117GA8","GOME590117HTSVCN07","ENRIQUE RAFAEL GOVEA MOCTEZUMA","24DPT0009M","","","",null,null,null,"","","",40,0,0,null,"","",40,0,0,108359.4384]
[null,"SAN LUIS POTOSI","GOMS6204091U8","GOMS620409MSPNNL00","SILVIA MARGARITA GONZALEZ MONJARAS","24DPT0005Q","","","",null,null,null,"","","",40,0,0,null,"","",40,0,0,75094.886500000008]
[null,"SAN LUIS POTOSI","GOZE620303R12","GOZE620303HSPLVV07","EVERARDO GLORIA ZAVALA","24DPT0005Q","","","",40,0,0,"","","","","","",null,"","",40,0,0,40498.496200000001]
[null,"SAN LUIS POTOSI","GUDE5903131Y1","GUDE590313MSPRZL08","MA. ELVIA GUERRERO DIAZ","24DPT0007O","","","",40,0,0,"","","","","","",null,"","",40,0,0,33067.7762]
[null,"SAN LUIS POTOSI","GUDJ5907187J8","GUDJ590718HTSRZS05","JESUS SALVADOR GUERRA DIAZ","24DPT0007O",40,0,0,null,null,null,"","","","","","",null,"","",40,0,0,41019.816700000003]
[null,"SAN LUIS POTOSI","GUHM580226452","GUHM580226MSPTRR02","MARTHA DE LA CRUZ GUTIERREZ HERNANDEZ","24DPT0005Q","","","",40,0,0,"","","","","","",null,"","",40,0,0,70023.749500000005]
[null,"SAN LUIS POTOSI","GUPS4410229S8","GUPS441022HSPJNL01","SALOMON FRANCISCO GUAJARDO PUENTE","24DPT0005Q","","","",40,0,0,"","","","","","",null,"","",40,0,0,37101.6005]
[null,"SAN LUIS POTOSI","GURJ750624QQ8","GURJ750624MSPTMN05","JUANA GUTIERREZ RAMIREZ","24DPT0001U",40,0,0,null,null,null,"","","","","","",null,"","",40,0,0,40522.189900000005]
[null,"SAN LUIS POTOSI","HEAL670226MP7","HEAL670226MSPRCT07","LETICIA HERNANDEZ ACOSTA","24DPT0005Q",40,0,0,null,null,null,"","","","","","",null,"","",40,0,0,45416.5962]
[null,"SAN LUIS POTOSI","HEHL8111128I5","HEHL811112HSPRRS09","JOSE LUIS HERNANDEZ HERNANDEZ","24DPT0001U","","","",40,0,0,"","","","","","",null,"","",40,0,0,36746.392500000002]
[null,"SAN LUIS POTOSI","HEHP770124UI6","HEHP770124HSPRRD02","PEDRO HERNANDEZ HERNANDEZ","24DPT0005Q","","","",40,0,0,"","","","","","",null,"","",40,0,0,33829.550200000005]
[null,"SAN LUIS POTOSI","HEJV7203106N5","HEJV720310HSPRRC02","VICENTE HERRERA JUAREZ","24DPT0001U","","","",40,0,0,"","","","","","",null,"","",40,0,0,27042.6695]
[null,"SAN LUIS POTOSI","HENC630117DV8","HENC630117MSPRVN09","MA. CONCEPCION HERNANDEZ NAVA","24DPT0001U","","","",null,null,null,"","","",40,0,0,null,"","",40,0,0,103940.64730000001]
[null,"SAN LUIS POTOSI","HEVH710718B30","HEVH710718MGTRLR03","HERLINDA HERNANDEZ VILLA","24DPT0005Q","","","",null,null,null,"","","","","","",40,0,0,40,0,0,85992.471000000005]
[null,"SAN LUIS POTOSI","HUEE8802101U6","HUEE880210MSPRSS07","ESMERALDA HUERTA ESPINO","24DPT0001U",40,0,0,null,null,null,"","","","","","",null,"","",40,0,0,6613.0050000000001]
[null,"SAN LUIS POTOSI","HUGE570105RR1","HUGE570105HSPRNM01","EMILIANO HUERTA GONZALEZ","24DPT0001U","","","",40,0,0,"","","","","","",null,"","",40,0,0,35624.903299999998]
[null,"SAN LUIS POTOSI","IAGR490127IV9","IAGR490127HSPBLF04","JOSE REFUGIO IBARRA GALLEGOS","24DPT0005Q","","","",40,0,0,"","","","","","",null,"","",40,0,0,39533.916100000002]
[null,"SAN LUIS POTOSI","IOGM6306269A8","IOGM630626HSPVMR05","JOSE MARTIN IVON GOMEZ","24DPT0007O","","","",40,0,0,"","","","","","",null,"","",40,0,0,27821.438000000002]
[null,"SAN LUIS POTOSI","JADV701114SJ4","JADV701114MSPSZR05","VERONICA JASSO DIAZ","24DPT0009X","","","",40,0,0,"","","","","","",null,"","",40,0,0,72108.695399999997]
[null,"SAN LUIS POTOSI","JAGT620724585","JAGT620724MSPMMR02","TERESA JAIME GOMEZ","24DPT0007O",40,0,0,null,null,null,"","","","","","",null,"","",40,0,0,37118.950300000004]
[null,"SAN LUIS POTOSI","JUBM570114M1A","JUBM570114MMNRRC01","MACRINA JUAREZ BARRIGA","24DPT0005Q","","","",40,0,0,"","","","","","",null,"","",40,0,0,40604.423600000002]
[null,"SAN LUIS POTOSI","LARA6807312Z9","LARA680731MSPLDN09","ANA MARIA LLAMAS RODRIGUEZ","24DPT0009M","","","",40,0,0,"","","","","","",null,"","",40,0,0,34756.1348]
[null,"SAN LUIS POTOSI","LEGS740525K51","LEGS740525HSPLNR07","SERGIO LEAL GONZALEZ","24DPT0001U","","","",null,null,null,"","","",40,0,0,null,"","",40,0,0,97045.770600000003]
[null,"SAN LUIS POTOSI","LELJ610303BE8","LELJ610303MSPJPN03","JUANA LEIJA LOPEZ","24DPT0009M","","","",40,0,0,"","","","","","",null,"","",40,0,0,22835.0285]
[null,"SAN LUIS POTOSI","LEMM840920N55","LEMM840920HSPYDR03","MARCO ANTONIO M. LEYVA MEDINA","24DPT0009X","","","",40,0,0,"","","","","","",null,"","",40,0,0,52365.184500000003]
[null,"SAN LUIS POTOSI","LOCJ580721MFC","LOCJ580721HSPMSN00","JUAN IGNACIO LOMELI CASTRO","24DPT0007O","","","",null,null,null,"","","",40,0,0,null,"","",40,0,0,93534.950200000007]
[null,"SAN LUIS POTOSI","LOEJ490328FF6","LOEJ490328HSPPSM03","JOSE JAIME LOPEZ ESCALANTE","24DPT0005Q","","","",40,0,0,"","","","","","",null,"","",40,0,0,36799.273500000003]
[null,"SAN LUIS POTOSI","LOEL560228TP6","LOEL560228HSPPSS08","JOSE LUIS LOPEZ ESPERICUETA","24DPT0009M","","","",40,0,0,"","","","","","",null,"","",40,0,0,37082.395900000003]
[null,"SAN LUIS POTOSI","LOFY8312272NS","LOFY831227MSPPZS08","YOSHELYN ESTHER LOPEZ FAZ","24DPT0009M","","","",40,0,0,"","","","","","",null,"","",40,0,0,29378.482600000003]
[null,"SAN LUIS POTOSI","LOHE7609184N6","LOHE760918MGTNRL00","ELSA LONGORIA HERNANDEZ","24DPT0009X","","","",null,null,null,"","","",40,0,0,null,"","",40,0,0,92285.276299999998]
[null,"SAN LUIS POTOSI","LOIJ9006248S2","LOIJ900624HSPPBN08","JUAN ANTONIO LOPEZ IBARRA","24DPT0005Q","","","",40,0,0,"","","","","","",null,"","",40,0,0,24292.98]
[null,"SAN LUIS POTOSI","LOMC710712LGA","LOMC710712MSPRDN03","MA. CONSUELO LOREDO MEDINA","24DPT0005Q","","","",40,0,0,"","","","","","",null,"","",40,0,0,38237.186300000001]
[null,"SAN LUIS POTOSI","LOMM890219AB3","LOMM890219MSPPTN09","MONICA SELENA LOPEZ MATA","24DPT0001U",40,0,0,null,null,null,"","","","","","",null,"","",40,0,0,3570.1840000000002]
[null,"SAN LUIS POTOSI","LOMS671103K68","LOMS671103MSPYXL06","SILVIA LAURA LOYOLA MEXICANO","24DPT0005Q",40,0,0,null,null,null,"","","","","","",null,"","",40,0,0,15004.163500000001]
[null,"SAN LUIS POTOSI","LUMF5609182L7","LUMF560918HSPNRR03","FRANCISCO LUNA MORA","24DPT0009M","","","",40,0,0,"","","","","","",null,"","",40,0,0,27819.0579]
[null,"SAN LUIS POTOSI","LUMO660710AW4","LUMO660710MSPNRF02","OFELIA LUNA MORA","24DPT0009M","","","",40,0,0,"","","","","","",null,"","",40,0,0,34413.6394]
[null,"SAN LUIS POTOSI","MACE730306K53","MACE730306MSPNDL03","ELDA GUADALUPE MANZANARES CEDILLO","24DPT0003S","","","",null,null,null,"","","",40,0,0,null,"","",40,0,0,97186.616300000009]
[null,"SAN LUIS POTOSI","MADV800530Q43","MADV800530MSPRLR06","VERONICA IVETTE MARTINEZ DELGADO","24DPT0003S","","","",40,0,0,"","","","","","",null,"","",40,0,0,36058.8223]
[null,"SAN LUIS POTOSI","MAEK7710123X3","MAEK771012MSPCLR08","KAREN MACIAS VALADEZ ELIAS","24DPT0009X","","","",null,null,null,"","","",40,0,0,null,"","",40,0,0,96812.579100000003]
[null,"SAN LUIS POTOSI","MAGA3904151C1","MAGA390415HSPRRN04","ANASTACIO MARTINEZ GARCIA","24DPT0003S","","","",40,0,0,"","","","","","",null,"","",40,0,0,39667.128600000004]
[null,"SAN LUIS POTOSI","MAGJ890820CJ8","MAGJ890820HSPTNN00","JONATHAN MATA GONZALEZ","24DPT0005Q","","","",40,0,0,"","","","","","",null,"","",40,0,0,22835.0285]
[null,"SAN LUIS POTOSI","MAGM710703LS8","MAGM710703MSPRTR04","MARILU MARTINEZ GUTIERREZ","24DPT0009M","","","",null,null,null,"","","",40,0,0,null,"","",40,0,0,92354.391199999998]
[null,"SAN LUIS POTOSI","MAIG680708QS5","MAIG680708HSPRBL07","GILBERTO MARTINEZ IBARRA","24DPT0003S",40,0,0,null,null,null,"","","","","","",null,"","",40,0,0,37881.806700000001]
[null,"SAN LUIS POTOSI","MAMH6305102W9","MAMH630510HNLNRC03","HECTOR DAVID MANZANARES MORENO","24DPT0003S","","","",null,null,null,"","","","","","",40,0,0,40,0,0,85992.417000000001]
[null,"SAN LUIS POTOSI","MAMJ560724770","MAMJ560724HSPRRN00","JUAN MANUEL MARTINEZ MARTINEZ","24DPT0003S","","","",40,0,0,"","","","","","",null,"","",40,0,0,69878.340100000001]
[null,"SAN LUIS POTOSI","MAML661226UW5","MAML661226MSPRLR04","LAURA ELISA MARTINEZ MELENDEZ","24DPT0005Q","","","",40,0,0,"","","","","","",null,"","",40,0,0,44143.643700000001]
[null,"SAN LUIS POTOSI","MAMR710125SH6","MAMR710125MMCDNB03","RUBI GUADALUPE MADRIGAL MENDEZ","24DPT0009M","","","",null,null,null,"","","",40,0,0,null,"","",40,0,0,103667.34420000001]
[null,"SAN LUIS POTOSI","MAOR6107121R7","MAOR610712HSPRRN06","RENE MARTINEZ ORTIGOZA","24DPT0005Q","","","",40,0,0,"","","","","","",null,"","",40,0,0,66718.5144]
[null,"SAN LUIS POTOSI","MAPD470328R25","MAPD470328HSPRRL01","J.DOLORES MARTINEZ PEREZ","24DPT0007O","","","",40,0,0,"","","","","","",null,"","",40,0,0,35160.161500000002]
[null,"SAN LUIS POTOSI","MARM6009139V5","MARM600913MSPTYR07","MARGARITA MATA REYES","24DPT0005Q","","","",40,0,0,"","","","","","",null,"","",40,0,0,36667.767899999999]
[null,"SAN LUIS POTOSI","MATG660909AX2","MATG660909MSPRRD06","MA.GUADALUPE MARTINEZ TERAN","24DPT0009M","","","",40,0,0,"","","","","","",null,"","",40,0,0,69602.619099999996]
[null,"SAN LUIS POTOSI","MATM681225M69","MATM681225MSPRRN01","MANUELA MARTINEZ TERAN","24DPT0009X","","","",null,null,null,"","","",40,0,0,null,"","",40,0,0,85321.297500000001]
[null,"SAN LUIS POTOSI","MAVJ811117IY1","MAVJ811117MSPRLN08","JUANA ISABEL MARTINEZ VELAZQUEZ","24DPT0007O","","","",40,0,0,"","","","","","",null,"","",40,0,0,23970.523400000002]
[null,"SAN LUIS POTOSI","MEBL691213A88","MEBL691213HSPJRS04","LUIS MANUEL MEJORADO BARRAGAN","24DPT0003S","","","",40,0,0,"","","","","","",null,"","",40,0,0,41887.226300000002]
[null,"SAN LUIS POTOSI","MEBR7304207S1","MEBR730420HSPJRY02","REYNALDO MEJORADO BARRAGAN","24DPT0003S","","","",40,0,0,"","","","","","",null,"","",40,0,0,19172.968500000003]
[null,"SAN LUIS POTOSI","MECA5608025R7","MECA560802MSPDHN03","MARIA ANGELICA MEDRANO CHAVEZ","24DPT0003S","","","",40,0,0,"","","","","","",null,"","",40,0,0,42308.414700000001]
[null,"SAN LUIS POTOSI","MEES680705HB4","MEES680705MNLNSR09","SARA MENDOZA ESPINOSA","24DPT0009X","","","",40,0,0,"","","","","","",null,"","",40,0,0,69153.094899999996]
[null,"SAN LUIS POTOSI","MEJR550324RF2","MEJR550324MSPLSS05","MARIA DEL ROSARIO MELENDEZ JASSO","24DPT0009M","","","",40,0,0,"","","","","","",null,"","",40,0,0,32349.871200000001]
[null,"SAN LUIS POTOSI","MEOP540116RN1","MEOP540116HSPXLR06","PORFIRIO MEXICANO OLIVA","24DPT0007O",40,0,0,null,null,null,"","","","","","",null,"","",40,0,0,39743.015599999999]
[null,"SAN LUIS POTOSI","MIEM640812V46","MIEM640812MCLJSR01","MARTHA FABIANA MIJARES ESPINOZA","24DPT0003S","","","",40,0,0,"","","","","","",null,"","",40,0,0,64846.090900000003]
[null,"SAN LUIS POTOSI","MIFJ490102E61","MIFJ490102MSPRRS07","MA. DE JESUS MIRELES FORTANELLI","24DPT0009M","","","",40,0,0,"","","","","","",null,"","",40,0,0,36434.433199999999]
[null,"SAN LUIS POTOSI","MOAL660825G18","MOXA660825HSPRXL06","ALFREDO MORENO .","24DPT0009M","","","",40,0,0,"","","","","","",null,"","",40,0,0,37854.478500000005]
[null,"SAN LUIS POTOSI","MOBO7207294K1","MOBO720729MSPRDF04","OFELIA MORALES BADILLO","24DPT0009M",40,0,0,null,null,null,"","","","","","",null,"","",40,0,0,43293.216800000002]
[null,"SAN LUIS POTOSI","MOGB710304G33","MOGB710304HSPRLN00","BENJAMIN OMAR MORALES GUILLEN","24DPT0001U",40,0,0,null,null,null,"","","","","","",null,"","",40,0,0,19872.200800000002]
[null,"SAN LUIS POTOSI","MORL810527AT0","MORL810527MSPRDR02","LAURA MARGARITA MORENO RODRIGUEZ","24DPT0003S",40,0,0,null,null,null,"","","","","","",null,"","",40,0,0,38737.561000000002]
[null,"SAN LUIS POTOSI","MUMM660415DR9","MUMM660415HGTXRS07","MOISES MUÑIZ MARQUEZ","24DPT0009X","","","",40,0,0,"","","","","","",null,"","",40,0,0,75764.277000000002]
[null,"SAN LUIS POTOSI","NAOF731005JG9","NAOF731005MSPVRB07","FABIOLA PATRICIA NAVA ORTIZ","24DPT0009M","","","",null,null,null,"","","",40,0,0,null,"","",40,0,0,96136.632600000012]
[null,"SAN LUIS POTOSI","OAHG511209TY7","OAHG511209MMNRND19","MA. GUADALUPE Y. ORDAZ HUANTE","24DPT0009X","","","",null,null,null,"","","",40,0,0,null,"","",40,0,0,75094.886500000008]
[null,"SAN LUIS POTOSI","OECG711212T95","OECG711212MSPLSD02","MA. GUADALUPE OLVERA CASTILLO","24DPT0005Q","","","",40,0,0,"","","","","","",null,"","",40,0,0,38376.871500000001]
[null,"SAN LUIS POTOSI","PAEJ630307MI6","PAEJ630307MSPLSN09","JUANA PALACIOS ESTRADA","24DPT0007O","","","",40,0,0,"","","","","","",null,"","",40,0,0,34358.669000000002]
[null,"SAN LUIS POTOSI","PAFL651004EV0","PAFL651004MSPLLT06","LETICIA PAULIN FLORES","24DPT0005Q","","","",40,0,0,"","","","","","",null,"","",40,0,0,34405.313900000001]
[null,"SAN LUIS POTOSI","PAGG590530IA4","PAGG590530HSPRRB04","GABRIEL PAREDES GUERRERO","24DPT0005Q",40,0,0,null,null,null,"","","","","","",null,"","",40,0,0,35906.1446]
[null,"SAN LUIS POTOSI","PEHG680622FW8","PEHG680622MQTRRB00","GABRIELA PEREZ HERNANDEZ","24DPT0001U",40,0,0,null,null,null,"","","","","","",null,"","",40,0,0,37144.712899999999]
[null,"SAN LUIS POTOSI","PEIS651209PB0","PEIS651209MSPRBC02","MARIA DEL SOCORRO PEREZ IBARRA","24DPT0001U","","","",40,0,0,"","","","","","",null,"","",40,0,0,62397.315800000004]
[null,"SAN LUIS POTOSI","PERM920321B89","PERM920321HSPXML06","MELCHOR IVAN PEÑA RAMIREZ","24DPT0003S","","","",40,0,0,"","","","","","",null,"","",40,0,0,18969.5085]
[null,"SAN LUIS POTOSI","PIPF601112G12","PIPF601112HCSNLR03","FRANCISCO RENATO PINEDA PALOMEQUE","24DPT0007O","","","",null,null,null,"","","",40,0,0,null,"","",40,0,0,93215.058000000005]
[null,"SAN LUIS POTOSI","PUCS731008NE9","PUCS731008HSPRRR06","SERGIO PURATA CRUZ","24DPT0001U","","","",40,0,0,"","","","","","",null,"","",40,0,0,32071.202600000001]
[null,"SAN LUIS POTOSI","RAAJ5411175IA","RAAJ541117HSPMMS03","JOSE RAMOS AMAYA","24DPT0009M","","","",null,null,null,"","","",40,0,0,null,"","",40,0,0,102884.1223]
[null,"SAN LUIS POTOSI","RAGC760321QD4","RAGC760321MSPMTL04","CLAUDIA IVONNE RAMOS GUTIERREZ","24DPT0009X","","","",40,0,0,"","","","","","",null,"","",40,0,0,75764.277000000002]
[null,"SAN LUIS POTOSI","RAGJ5903149W1","RAGJ590314HSPMRN03","JUAN RAMOS GARCIA","24DPT0005Q","","","",40,0,0,"","","","","","",null,"","",40,0,0,38377.403300000005]
[null,"SAN LUIS POTOSI","RAGR661201RT1","RAGR661201HSPMRM02","RAMON RAMOS GARCIA","24DPT0005Q","","","",40,0,0,"","","","","","",null,"","",40,0,0,35320.7958]
[null,"SAN LUIS POTOSI","RAML640920MT9","RAML640920MSPNRR16","MA. DE LOURDES RANGEL MARTINEZ","24DPT0005Q",40,0,0,null,null,null,"","","","","","",null,"","",40,0,0,35967.971799999999]
[null,"SAN LUIS POTOSI","REMO730405JA0","REMO730405MVZDTJ15","OJILVIA REDONDO MATEOS","24DPT0001U","","","",40,0,0,"","","","","","",null,"","",40,0,0,62131.144100000005]
[null,"SAN LUIS POTOSI","RILR531105JV6","RILR531105HSPVPF03","RAFAEL RIVERA LOPEZ","24DPT0009M","","","",40,0,0,"","","","","","",null,"","",40,0,0,38358.168300000005]
[null,"SAN LUIS POTOSI","RIPC880609KX9","RIPC880609MSPVLN03","CANDIDA NALLELY RIVERA PALACIOS","24DPT0001U","","","",40,0,0,"","","","","","",null,"","",40,0,0,25622.551200000002]
[null,"SAN LUIS POTOSI","ROAR710803LR5","ROAR710803HSPJLL08","RAUL ROJAS ALVARADO","24DPT0003S","","","",40,0,0,"","","","","","",null,"","",40,0,0,67724.051300000006]
[null,"SAN LUIS POTOSI","ROAV540405B30","ROAV540405HSPCLC05","VICENTE ROCHA ALVARADO","24DPT0009M","","","",40,0,0,"","","","","","",null,"","",40,0,0,72017.055800000002]
[null,"SAN LUIS POTOSI","ROCJ770306E42","ROCJ770306MSPDBS15","JESSICA ARELY RODRIGUEZ CABRERA","24DPT0009X","","","",40,0,0,"","","","","","",null,"","",40,0,0,54290.624500000005]
[null,"SAN LUIS POTOSI","ROEH7612111R2","ROEH761211HTSJSG04","HUGO DANIEL ROJAS ESCAREÑO","24DPT0005Q","","","",40,0,0,"","","","","","",null,"","",40,0,0,26831.0834]
[null,"SAN LUIS POTOSI","ROHC591104GNA","ROHC591104HTSDRR02","CARLOS RODRIGUEZ HERNANDEZ","24DPT0009M","","","",null,null,null,"","","",40,0,0,null,"","",40,0,0,110294.4418]
[null,"SAN LUIS POTOSI","ROMJ691226UG8","ROMT691226HSPDLM00","JOSE TOMAS RODRIGUEZ MALDONADO","24DPT0001U",40,0,0,null,null,null,"","","","","","",null,"","",40,0,0,19158.123500000002]
[null,"SAN LUIS POTOSI","ROMN380628S80","ROMN380628HSPDTC04","NICOLAS RODRIGUEZ MATA","24DPT0005Q","","","",40,0,0,"","","","","","",null,"","",40,0,0,35700.699400000005]
[null,"SAN LUIS POTOSI","ROOJ620202C77","ROOJ620202MSPDRR00","JEORGINA RODRIGUEZ ORTEGA","24DPT0005Q",40,0,0,null,null,null,"","","","","","",null,"","",40,0,0,36610.484799999998]
[null,"SAN LUIS POTOSI","RORR520329DU7","RORR520329HTSJVB07","ROBERTO ROJAS RIVERO","24DPT0005Q","","","",40,0,0,"","","","","","",null,"","",40,0,0,46086.0118]
[null,"SAN LUIS POTOSI","RORR811129MR5","RORR811129MSPCDC01","ROCIO ROCHA RODRIGUEZ","24DPT0009M","","","",40,0,0,"","","","","","",null,"","",40,0,0,33574.462500000001]
[null,"SAN LUIS POTOSI","ROVC771023CW0","ROVC771023HSPMDR00","CARLOS ALBERTO ROMO VIDALES","24DPT0001U","","","",40,0,0,"","","","","","",null,"","",40,0,0,31868.222800000003]
[null,"SAN LUIS POTOSI","RUSM860809AZ3","RUSM860809HSPZLR03","MARCOS LORENZO RUIZ SILVA","24DPT0005Q","","","",40,0,0,"","","","","","",null,"","",40,0,0,2969.97]
[null,"SAN LUIS POTOSI","SAGM540516420","SAGM540516MMCNMN07","MINERVA ANA MARIA SANCHEZ GOMEZ","24DPT0007O",40,0,0,null,null,null,"","","","","","",null,"","",40,0,0,36567.970600000001]
[null,"SAN LUIS POTOSI","SAGR701024AV1","SAGR701024HSPLLF07","RAFAEL SALAS GALAVIZ","24DPT0005Q","","","",40,0,0,"","","","","","",null,"","",40,0,0,27594.4725]
[null,"SAN LUIS POTOSI","SAHN7508099U9","SAHN750809MSPCRR08","NORMA DELIA SAUCEDA HERNANDEZ","24DPT0003S","","","",40,0,0,"","","","","","",null,"","",40,0,0,21870.113100000002]
[null,"SAN LUIS POTOSI","SAHS851106JW8","SAHS851106MSPNRL02","SELENE MILAGROS SANCHEZ HERNANDEZ","24DPT0001U","","","",null,null,null,"","","",40,0,0,null,"","",40,0,0,67614.056500000006]
[null,"SAN LUIS POTOSI","SAHV7005203N4","SAHV700520HSPLRC05","VICTOR HUGO SALAZAR HERRERA","24DPT0003S","","","",null,null,null,"","","",40,0,0,null,"","",40,0,0,90072.577700000009]
[null,"SAN LUIS POTOSI","SAPC761004QI1","SAPC761004MSPNRR02","CARMEN LISETTE SANCHEZ PEREZ","24DPT0009X","","","",null,null,null,"","","",40,0,0,null,"","",40,0,0,92947.143200000006]
[null,"SAN LUIS POTOSI","SARE6202234P9","SARE620223MGTNYL05","ELVA MARTHA SANCHEZ REYES","24DPT0009M",40,0,0,null,null,null,"","","","","","",null,"","",40,0,0,37964.621299999999]
[null,"SAN LUIS POTOSI","SARI650522GIA","SAXR650522MDGPXT03","RITA SAPATA .","24DPT0009M",40,0,0,null,null,null,"","","","","","",null,"","",40,0,0,35124.020799999998]
[null,"SAN LUIS POTOSI","SARL580921DP4","SARL580921MSPNYL00","LILIANA ARACELI SANCHEZ REYES","24DPT0001U",40,0,0,null,null,null,"","","","","","",null,"","",40,0,0,41949.765700000004]
[null,"SAN LUIS POTOSI","SARS600827T73","SARS600827HSPNYX08","SIXTO ARMANDO SANCHEZ REYES","24DPT0001U",40,0,0,null,null,null,"","","","","","",null,"","",40,0,0,34031.285600000003]
[null,"SAN LUIS POTOSI","SASC740427A77","SASC740427MSPNSY06","CYNTHIA ANGELICA SANCHEZ SESMA","24DPT0009X","","","",null,null,null,"","","",40,0,0,null,"","",40,0,0,97433.496299999999]
[null,"SAN LUIS POTOSI","SASD751228176","SASD751228MGTNNL02","MA. DOLORES SANCHEZ SANCHEZ","24DPT0007O","","","",40,0,0,"","","","","","",null,"","",40,0,0,61634.313600000001]
[null,"SAN LUIS POTOSI","SAVY6603309K7","SAVY660330MSPNLL09","YOLANDA SANCHEZ VALENZUELA","24DPT0001U","","","",null,null,null,"","","",40,0,0,null,"","",40,0,0,112480.8818]
[null,"SAN LUIS POTOSI","SICJ650205IN3","SICJ650205HSPLSN04","JUAN FELIPE DE JE SILVA CASTILLO","24DPT0003S",40,0,0,null,null,null,"","","","","","",null,"","",40,0,0,36609.118900000001]
[null,"SAN LUIS POTOSI","SILJ7207131L2","SILJ720713HSPFPN00","JUAN FRANCISCO SIFUENTES LOPEZ","24DPT0003S","","","",null,null,null,"","","",40,0,0,null,"","",40,0,0,91211.152300000002]
[null,"SAN LUIS POTOSI","SIRF691225FK9","SIRF691225HDFLSR07","FRANCISCO SILVA ROSAS","24DPT0007O","","","",null,null,null,"","","","","","",40,0,0,40,0,0,85992.417000000001]
[null,"SAN LUIS POTOSI","SIRS660627HNA","SIRS660627HSPRJR03","SERGIO SIRENO ROJAS","24DPT0003S",40,0,0,null,null,null,"","","","","","",null,"","",40,0,0,36722.753499999999]
[null,"SAN LUIS POTOSI","SURS62121622A","SURS621216HSPSCL09","JOSE SALVADOR SUSTAITA ROCHA","24DPT0005Q","","","",40,0,0,"","","","","","",null,"","",40,0,0,33912.350200000001]
[null,"SAN LUIS POTOSI","TEBO821119NQ5","TEBO821119HHGRLS07","OSCAR TREJO BELTRAN","24DPT0001U","","","",40,0,0,"","","","","","",null,"","",40,0,0,26829.163400000001]
[null,"SAN LUIS POTOSI","TEDR630916EX2","TEDR630916HSPLZG06","ROGELIO MARTIN TELLO DIAZ","24DPT0005Q","","","",40,0,0,"","","","","","",null,"","",40,0,0,40282.805]
[null,"SAN LUIS POTOSI","TOCJ611031345","TOCJ611031MSPRRN04","JUANA MARIA TORRES CRUZ","24DPT0009M","","","",40,0,0,"","","","","","",null,"","",40,0,0,36318.733500000002]
[null,"SAN LUIS POTOSI","TOFJ781224GT6","TOFJ781224MSPRLS02","MARIA DE JESUS TORRES FLORES","24DPT0009M","","","",40,0,0,"","","","","","",null,"","",40,0,0,30995.069900000002]
[null,"SAN LUIS POTOSI","TOSC640102T47","TOSC640102MSPRLR03","CARMEN JULIA TORRES SOLIS","24DPT0001U","","","",null,null,null,"","","",40,0,0,null,"","",40,0,0,98028.563099999999]
[null,"SAN LUIS POTOSI","TOST581016ED7","TOST581016HGTRNR07","JOSE TERESO TORRES SANCHEZ","24DPT0009M","","","",40,0,0,"","","","","","",null,"","",40,0,0,41736.289700000001]
[null,"SAN LUIS POTOSI","TUBA630811ME9","TUBA630811HSPDLL18","ALAYN TUDON BALDAZO","24DPT0009M","","","",40,0,0,"","","","","","",null,"","",40,0,0,14997.85]
[null,"SAN LUIS POTOSI","UOAE5801257F6","UOAE580125MSPLLL00","MARIA ELVIRA ULLOA ALVAREZ","24DPT0009M","","","",40,0,0,"","","","","","",null,"","",40,0,0,36821.402500000004]
[null,"SAN LUIS POTOSI","VACE770426NC0","VACE770426HSPZRR04","JOSE ERNESTO VAZQUEZ CARRION","24DPT0003S","","","",40,0,0,"","","","","","",null,"","",40,0,0,24717.166700000002]
[null,"SAN LUIS POTOSI","VARL840419V1A","VARL840419HSPZDS08","LUIS JAFET VAZQUEZ RODRIGUEZ","24DPT0001U","","","",40,0,0,"","","","","","",null,"","",40,0,0,23330.218400000002]
[null,"SAN LUIS POTOSI","VETL800309V15","VETL800309HSPLRS06","LUIS MANUEL VELAZQUEZ TREJO","24DPT0001U","","","",40,0,0,"","","","","","",null,"","",40,0,0,26653.8995]
[null,"SAN LUIS POTOSI","VIBE670614TR4","VIBE670614MSPLNL00","MARIA ELEAZAR VILLELA BUENO","24DPT0005Q","","","",40,0,0,"","","","","","",null,"","",40,0,0,44463.302200000006]
[null,"SAN LUIS POTOSI","YEIJ5912243Z0","YEIJ591224HSPRBV07","JAVIER YERA IBARRA","24DPT0009M","","","",40,0,0,"","","","","","",null,"","",40,0,0,59825.114100000006]
[null,"SAN LUIS POTOSI","ZARC720415D80","ZARC720415MSPMCR04","MARIA DEL CARMEN ZAMARRON ROCHA","24DPT0005Q","","","",40,0,0,"","","","","","",null,"","",40,0,0,33829.658600000002]
[null,"SAN LUIS POTOSI","ZASL640121432","ZASL640121MSPVTZ04","LUZ MARIA ZAVALZA STIKER","24DPT0003S","","","",40,0,0,"","","","","","",null,"","",40,0,0,60159.918900000004]
[null,"SAN LUIS POTOSI","CEPJ6204099P","CEPJ620409HDFDNN07","JUAN MANUEL CEDILLO PONCE","24DPT0005Q",null,null,null,null,null,null,null,null,null,null,null,null,null,null,null,0,20,0,3016.016032]
[null,"SAN LUIS POTOSI","CUAO5611296R8","CUAO561129HSPRLS04","OSCAR  CRUZ ALVARADO","24DPT0005Q",null,null,null,null,null,null,null,null,null,null,null,null,null,null,null,0,20,0,21582.6]
[null,"SAN LUIS POTOSI","FAGS780307E56","FAGS780307MSPCRS07","SUSANA FACUNDO GARCIA","24DPT0005Q",null,null,null,null,null,null,null,null,null,null,null,null,null,null,null,0,20,0,21600.530000000002]
[null,"SAN LUIS POTOSI","MOEA5904238FA","MOEA590423HGTCSD04","ADALBERTO MOCTEZUMA ESTRADA","24DPT0009M",null,null,null,null,null,null,null,null,null,null,null,null,null,null,null,0,20,0,17924.489999999998]
[null,"SAN LUIS POTOSI","BECA5712192K9","BECA571219HGRNRD04","ADAN BENITEZ  CARDOSO","24DPT0009M",null,null,null,null,null,null,null,null,null,null,null,null,null,null,null,0,20,0,6526.7690000000011]
[null,"SAN LUIS POTOSI","MOCA671120BJ1","MOCA671120MSPNSD04","ADELA MONROY CASTILLO","24DPT0001U",null,null,null,null,null,null,null,null,null,null,null,null,null,null,null,0,20,0,13083.86]
[null,"SAN LUIS POTOSI","ROLA600205R52","ROLA600205MSPDPD01","RODRIGUEZ LOPEZ ADRIANA LETICIA","24DPT0007O",null,null,null,null,null,null,null,null,null,null,null,null,null,null,null,0,20,0,20484.36]
[null,"SAN LUIS POTOSI","PAGA641218772","PAGA641218HSPTRG09","AGRACIANO PAITA GARCIA","24DPT0001U",null,null,null,null,null,null,null,null,null,null,null,null,null,null,null,0,20,0,15024.32]
[null,"SAN LUIS POTOSI","RAMA401010NW3","RAMA401010HSPMRG01","AGUSTIN RAMIREZ MURGUIA","24DPT0009M",null,null,null,null,null,null,null,null,null,null,null,null,null,null,null,0,20,0,8005.3100000000013]
[null,"SAN LUIS POTOSI","HECA810404QG4","HECA810404HSPRBL07","HERNANDEZ CABRERA ALAIN ALBERTO","24DPT0007O",null,null,null,null,null,null,null,null,null,null,null,null,null,null,null,0,0,0,0]
[null,"SAN LUIS POTOSI","GOZA820215BL6","GOZA820215MSPNML05","ALEJANDRA GONZALEZ ZAMORA","24DPT0001U",null,null,null,null,null,null,null,null,null,null,null,null,null,null,null,0,17,0,4417.05]
[null,"SAN LUIS POTOSI","OELA460529MR5","OELA460529MSPRSL02","ALEJANDRINA ORELLANA LASTRE","24DPT0009M",null,null,null,null,null,null,null,null,null,null,null,null,null,null,null,0,16,0,13678.210000000001]
[null,"SAN LUIS POTOSI","AUFA630503DX7","AUFA630503HSPGRL08","ALEJANDRO AGUILAR FERNANDEZ","24DPT0001U",null,null,null,null,null,null,null,null,null,null,null,null,null,null,null,0,20,0,9583.8299999999981]
[null,"SAN LUIS POTOSI","AEMJ860512688","AEMJ860512HSPLDL07","ALEJO MEDINA JOEL EMMANUEL","24DPT0003S",null,null,null,null,null,null,null,null,null,null,null,null,null,null,null,0,16,0,13257.269999999997]
[null,"SAN LUIS POTOSI","LEGA500601HSP","LEGA500601HSPZRL09","LEZAMA GARCIA ALFONSO","24DPT0007O",null,null,null,null,null,null,null,null,null,null,null,null,null,null,null,0,8,0,7602.78]
[null,"SAN LUIS POTOSI","GAGA651210UL1","GAGA651210HSPRRL03","ALFREDO GARCIA GARCIA","24DPT0009M",null,null,null,null,null,null,null,null,null,null,null,null,null,null,null,0,20,0,11474.341799999998]
[null,"SAN LUIS POTOSI","LAAA81021221A","LAAA810212HSPRLL05","ALFREDO LARA ALVAREZ","24DPT0001U",null,null,null,null,null,null,null,null,null,null,null,null,null,null,null,0,18,0,5164.7099999999991]
[null,"SAN LUIS POTOSI","PEAA520909BV4","PEAA520909HSPRRL08","ALFREDO PEREZ ARAUJO","24DPT0005Q",null,null,null,null,null,null,null,null,null,null,null,null,null,null,null,0,20,0,13954.7266]
[null,"SAN LUIS POTOSI","MAMA610628PT8","MAMA610628MSPRXL03","ALICIA MARTINEZ MUÑOZ","24DPT0005Q",null,null,null,null,null,null,null,null,null,null,null,null,null,null,null,0,20,0,12698.091035999998]
[null,"SAN LUIS POTOSI","GOGA740612IVA","GOGA740612MMCMVL04","ALMA DELIA GOMEZ GUEVARA","24DPT0009M",null,null,null,null,null,null,null,null,null,null,null,null,null,null,null,0,20,0,13330.1518]
[null,"SAN LUIS POTOSI","POLA651003BG8","POLA651003MVZRRL02","ALMA DELIA PORTILLA LARA","24DPT0001U",null,null,null,null,null,null,null,null,null,null,null,null,null,null,null,0,20,0,19008.82]
[null,"SAN LUIS POTOSI","MAAA780120V62","MAAA780120MSPRNL01","ALMA GEORGINA MARTIN DEL CAMPO DE ANDA","24DPT0005Q",null,null,null,null,null,null,null,null,null,null,null,null,null,null,null,0,20,0,24521.670000000002]
[null,"SAN LUIS POTOSI","JAAA7312072T4","JAAA731207HSPCCM05","JACOBO ACEVEDO AMBROSIO","24DPT0007O",null,null,null,null,null,null,null,null,null,null,null,null,null,null,null,0,20,0,18362.189999999999]
[null,"SAN LUIS POTOSI","GACA680719NP9","GACA680719MSPLSN09","ANA DELIA GALLEGOS CASTAÑEDA","24DPT0001U",null,null,null,null,null,null,null,null,null,null,null,null,null,null,null,0,20,0,24430.11]
[null,"SAN LUIS POTOSI","AARA750630J19","AARA750630MSPLBN00","ANA KARINA ALVARADO ROBLEDO","24DPT0009M",null,null,null,null,null,null,null,null,null,null,null,null,null,null,null,0,20,0,14119.210000000001]
[null,"SAN LUIS POTOSI","PEMA781108LS3","PEMA781108MSPRXN05","PEREZ MUÑIZ ANA LUISA","24DPT0007O",null,null,null,null,null,null,null,null,null,null,null,null,null,null,null,0,20,0,20729.96]
[null,"SAN LUIS POTOSI","HEGA550329U57","HEGA550329MSPRTN07","ANA MA. VIOLETA HERNANDEZ GUTIERREZ","24DPT0009M",null,null,null,null,null,null,null,null,null,null,null,null,null,null,null,0,20,0,14404.949999999999]
[null,"SAN LUIS POTOSI","DUCA550723HA8","DUCA550723MSPRHN06","ANA MARIA DUARTE CHAVEZ","24DPT0001U",null,null,null,null,null,null,null,null,null,null,null,null,null,null,null,0,14,0,3871.7599999999998]
[null,"SAN LUIS POTOSI","JACA790718KPA","JACA790718MSPCRN06","JACOBO CORONADO ANA MIRIAM","24DPT0007O",null,null,null,null,null,null,null,null,null,null,null,null,null,null,null,0,20,0,17524.91]
[null,"SAN LUIS POTOSI","DUCA550723HA8","DUCA550723MSPRHN06","ANNA MARÍA DUARTE CHAVEZ","24DPT0001U",null,null,null,null,null,null,null,null,null,null,null,null,null,null,null,0,17,0,4603.9799999999996]
[null,"SAN LUIS POTOSI","MAVA580913UN9","MAVA580913HSPRGN04","ANTONIO MARTINEZ VEGA","24DPT0005Q",null,null,null,null,null,null,null,null,null,null,null,null,null,null,null,0,20,0,21061.119999999999]
[null,"SAN LUIS POTOSI","PELA710227AF5","PELA710227HSPRRN06","ANTONIO ALEJANDRO PEREZ  LOREDO","24DPT0005Q",null,null,null,null,null,null,null,null,null,null,null,null,null,null,null,0,20,0,21981.299999999985]
[null,"SAN LUIS POTOSI","MACA571230PH6","MACA571230HSPRRP02","APOLINAR MARTINEZ CRUZ","24DPT0005Q",null,null,null,null,null,null,null,null,null,null,null,null,null,null,null,0,20,0,25294.789999999997]
[null,"SAN LUIS POTOSI","FEIA650129TV7","FEIA650129HSPRZQ03","AQUILES FERNANDEZ IZAGUIRRE","24DPT0001U",null,null,null,null,null,null,null,null,null,null,null,null,null,null,null,0,20,0,21800.640000000003]
[null,"SAN LUIS POTOSI","EICA671114M66","EICA671114MSPSSR06","ARACELI CASTILLO ESPINOSA","24DPT0001U",null,null,null,null,null,null,null,null,null,null,null,null,null,null,null,0,12,0,3122.0299999999997]
[null,"SAN LUIS POTOSI","VAHA700212797","VAHA700212MTSZRR08","ARISTEA VAZQUEZ HERNANDEZ","24DPT0009M",null,null,null,null,null,null,null,null,null,null,null,null,null,null,null,0,20,0,3745.5594000000001]
[null,"SAN LUIS POTOSI","RORA6702065V1","RORA670206HDGDDR08","ARMANDO RODRIGUEZ RODRIGUEZ","24DPT0009M",null,null,null,null,null,null,null,null,null,null,null,null,null,null,null,0,20,0,15777.02]
[null,"SAN LUIS POTOSI","ROVA670604Q3A","ROVA670604HSPDRR06","ARNOLDO RODRIGUEZ VARELA","24DPT0009M",null,null,null,null,null,null,null,null,null,null,null,null,null,null,null,0,20,0,-198481.04700800002]
[null,"SAN LUIS POTOSI","CAGA681224DN5","CXGA681224HSPBLR04","ARTURO CABRERA GALVAN ","24DPT0005Q",null,null,null,null,null,null,null,null,null,null,null,null,null,null,null,0,20,0,21621.85]
[null,"SAN LUIS POTOSI","TINA691007H57","TINA691007HSPRJR05","TIRADO NAJERA ARTURO","24DPT0007O",null,null,null,null,null,null,null,null,null,null,null,null,null,null,null,0,20,0,19975.049999999996]
[null,"SAN LUIS POTOSI","OEMA640824146","OEMA640824MSPRRR09","AUREA ORTEGA MARTINEZ","24DPT0001U",null,null,null,null,null,null,null,null,null,null,null,null,null,null,null,0,20,0,16586.72]
[null,"SAN LUIS POTOSI","BEGB530213FVA","BEGB530213HSPTMN03","BENIGNO  BETANCOURT GOMEZ","24DPT0009M",null,null,null,null,null,null,null,null,null,null,null,null,null,null,null,0,20,0,16726.370000000003]
[null,"SAN LUIS POTOSI","RORB561112GP8","RORB561112HSPJDN08","BENJAMIN ROJAS RODRIGUEZ","24DPT0009M",null,null,null,null,null,null,null,null,null,null,null,null,null,null,null,0,20,0,16839.810000000001]
[null,"SAN LUIS POTOSI","MASB6902131Q9","MASB690213MSPRCL09","BLANCA ESTELA MARTINEZ SAUCEDO","24DPT0009M",null,null,null,null,null,null,null,null,null,null,null,null,null,null,null,0,20,0,4918.5760999999993]
[null,"SAN LUIS POTOSI","BIGC730914SF1","BIGC730914MSPRTR09","BRIONES GUTIERREZ CAROLINA DEL CARMEN","24DPT0003S",null,null,null,null,null,null,null,null,null,null,null,null,null,null,null,0,20,0,25373.789999999997]
[null,"SAN LUIS POTOSI","CARH7709011FA","CARH770901HDFMYC01","CAMACHO REY HECTOR FELIPE","24DPT0003S",null,null,null,null,null,null,null,null,null,null,null,null,null,null,null,0,11,0,9813.6700000000055]
[null,"SAN LUIS POTOSI","PETC6811049X1","PETC681104HSPRRR06","PEREZ TERAN CARLOS","24DPT0007O",null,null,null,null,null,null,null,null,null,null,null,null,null,null,null,0,20,0,23651.11]
[null,"SAN LUIS POTOSI","VEFC760726CG9","VEFC760726MSPGNR08","CAROLINA VEGA FUENTES","24DPT0001U",null,null,null,null,null,null,null,null,null,null,null,null,null,null,null,0,18,0,3857.95]
[null,"SAN LUIS POTOSI","CAVS630617M45","CAVS630617MSPSLL08","CASTILLEJA VALADEZ SILVIA LEONOR","24DPT0003S",null,null,null,null,null,null,null,null,null,null,null,null,null,null,null,0,20,0,21992.820000000007]
[null,"SAN LUIS POTOSI","CAOG7903238I0","CAOG790323HSPSRS18","CASTILLO ORTIZ GUSTAVO LEONEL","24DPT0003S",null,null,null,null,null,null,null,null,null,null,null,null,null,null,null,0,20,0,21829.359999999997]
[null,"SAN LUIS POTOSI","RAMC620706QN2","RAMC620706HSPMDS09","CESAREO RAMIREZ MEDINA","24DPT0001U",null,null,null,null,null,null,null,null,null,null,null,null,null,null,null,0,20,0,18215.39]
[null,"SAN LUIS POTOSI","EADC731211D","EADC731211MSPSQL09","CLARA EMILIA ESPARZA DUQUE","24DPT0005Q",null,null,null,null,null,null,null,null,null,null,null,null,null,null,null,0,20,0,17636.511880000002]
[null,"SAN LUIS POTOSI","CAGC810922339","CAGC810922MSPNZL09","CLAUDIA IVONE CANELA  GUZMAN","24DPT0009M",null,null,null,null,null,null,null,null,null,null,null,null,null,null,null,0,20,0,15836.26999999999]
[null,"SAN LUIS POTOSI","MOCC7211273F5","MOCC721127MGTNRN03","CONCEPCION CATALINA MONASTERIO CRUZ","24DPT0005Q",null,null,null,null,null,null,null,null,null,null,null,null,null,null,null,0,20,0,15935.45592]
[null,"SAN LUIS POTOSI","CORJ781225526","CORJ781225MSPNTS08","CONTRERAS RETA JESSICA ELIZABETH","24DPT0003S",null,null,null,null,null,null,null,null,null,null,null,null,null,null,null,0,20,0,19742.28999999999]
[null,"SAN LUIS POTOSI","AACC6407247EA","AACC640724HSPRNT02","ARANDA CONTRERAS CUITLAHUAC","24DPT0007O",null,null,null,null,null,null,null,null,null,null,null,null,null,null,null,0,20,0,18558.18]
[null,"SAN LUIS POTOSI","MESC800926CZ5","MESC800926HSPNLT03","CUITLAHUAC MENDEZ SALADO","24DPT0009M",null,null,null,null,null,null,null,null,null,null,null,null,null,null,null,0,20,0,310.02999999999997]
[null,"SAN LUIS POTOSI","CORD851103291","CORD851103MSPRMF01","CORPUS RAMIREZ DAFNE SILVANA","24DPT0007O",null,null,null,null,null,null,null,null,null,null,null,null,null,null,null,0,18,0,13682.599999999997]
[null,"SAN LUIS POTOSI","HELD680228RP9","HELD680228HSPRPV08","DAVID HERNANDEZ LOPEZ","24DPT0009M",null,null,null,null,null,null,null,null,null,null,null,null,null,null,null,0,20,0,19320.329999999994]
[null,"SAN LUIS POTOSI","SAHD750908E51","SAHD750908HSPNRV09","DAVID ANGEL SANCHEZ HERNANDEZ","24DPT0005Q",null,null,null,null,null,null,null,null,null,null,null,null,null,null,null,0,20,0,16591.6672]
[null,"SAN LUIS POTOSI","SOLD660417GY5","SOLD660417MSPTNR02","DORA SILVIA SOTO DE LEON","24DPT0001U",null,null,null,null,null,null,null,null,null,null,null,null,null,null,null,0,20,0,21445.9]
[null,"SAN LUIS POTOSI","PEBD761216MQ9","PEBD761216MMCRRL02","PEREZ BRAVO DULCE MARIA","24DPT0007O",null,null,null,null,null,null,null,null,null,null,null,null,null,null,null,0,20,0,22458.73]
[null,"SAN LUIS POTOSI","TEGD790912B79","TEGD790912MSPRNL09","DULCE MARIA TREJO GONZALEZ","24DPT0001U",null,null,null,null,null,null,null,null,null,null,null,null,null,null,null,0,20,0,21367.860000000004]
[null,"SAN LUIS POTOSI","MABE7612078W9","MABE761207MSPRRD09","EDISA MARQUEZ BARRIOS","24DPT0009M",null,null,null,null,null,null,null,null,null,null,null,null,null,null,null,0,20,0,18286.2]
[null,"SAN LUIS POTOSI","MAVE851119B46","MAVE851119HSPRGD03","MARTINEZ VEGA EDOARDO ALEXANDRO","24DPT0009M",null,null,null,null,null,null,null,null,null,null,null,null,null,null,null,0,14,0,10757.05]
[null,"SAN LUIS POTOSI","RIBE540723J49","RIBE540723HSPVRD02","EDUARDO RIVERA BERRONES","24DPT0009M",null,null,null,null,null,null,null,null,null,null,null,null,null,null,null,0,20,0,13610.880000000001]
[null,"SAN LUIS POTOSI","ROME710215117","ROME710215MSPJYL08","ELIA ARACELI ROJO MAYA","24DPT0001U",null,null,null,null,null,null,null,null,null,null,null,null,null,null,null,0,20,0,8662.8499999999985]
[null,"SAN LUIS POTOSI","TONE7403103J6","TONE740310HSPVTL06","ELICER TOVAR NIETO","24DPT0001U",null,null,null,null,null,null,null,null,null,null,null,null,null,null,null,0,20,0,21432.81]
[null,"SAN LUIS POTOSI","MALE770614155","MALE770614MPLRPL14","MARTINEZ LOPEZ ELIZABETH ANDRIKA","24DPT0007O",null,null,null,null,null,null,null,null,null,null,null,null,null,null,null,0,18,0,2223.09]
[null,"SAN LUIS POTOSI","SAPE711122AK5","SAPE711122HSPMLL00","ELOI SAMANO PONCE","24DPT0001U",null,null,null,null,null,null,null,null,null,null,null,null,null,null,null,0,20,0,19920.490000000002]
[null,"SAN LUIS POTOSI","VEME560602PR6","VEME560602HSPGRM09","EMILIO VEGA MARTINEZ","24DPT0009M",null,null,null,null,null,null,null,null,null,null,null,null,null,null,null,0,20,0,6841.0980000000009]
[null,"SAN LUIS POTOSI","GAME760915HS9","GAME760915MSPLDN02","GALLARDO MEDINA EMMA NOELIA","24DPT0007O",null,null,null,null,null,null,null,null,null,null,null,null,null,null,null,0,20,0,6619.8600000000015]
[null,"SAN LUIS POTOSI","ZATE831201JU2","ZATE831201HSPVRR07","ERIC ZAVALIJA TORRES","24DPT0005Q",null,null,null,null,null,null,null,null,null,null,null,null,null,null,null,0,12,0,1994.0900000000001]
[null,"SAN LUIS POTOSI","GOCE870717B66","GOCE870717MSPNSR02","GONZALEZ CISNEROS ERIKA DEYADIRA","24DPT0007O",null,null,null,null,null,null,null,null,null,null,null,null,null,null,null,0,15,0,15538.820000000002]
[null,"SAN LUIS POTOSI","OOGE690102199","OOGE690102HPLSRR04","ERNESTO OSORIO GARCÍA","24DPT0009M",null,null,null,null,null,null,null,null,null,null,null,null,null,null,null,0,9,0,2155.66]
[null,"SAN LUIS POTOSI","EARE6710027E0","EARE671002MSPSNS06","ESTHER ESCALANTE RANGEL","24DPT0001U",null,null,null,null,null,null,null,null,null,null,null,null,null,null,null,0,20,0,20078.39]
[null,"SAN LUIS POTOSI","MUCE500527AZA","MUCE500527MSPNRS08","MUNGUIA CERVANTES ESTHER","24DPT0001U",null,null,null,null,null,null,null,null,null,null,null,null,null,null,null,0,20,0,7375.7]
[null,"SAN LUIS POTOSI","MUCE500527AZA","MUCE500527MSPNRS08","ESTHER MUNGUIA CERVANTES","24DPT0001U",null,null,null,null,null,null,null,null,null,null,null,null,null,null,null,0,20,0,213.21999999999997]
[null,"SAN LUIS POTOSI","EAMT6110155X2","EAMT611015MSPSRR06","ESTRADA MORALES TERESA DE JESUS","24DPT0003S",null,null,null,null,null,null,null,null,null,null,null,null,null,null,null,0,20,0,14915.121620000002]
[null,"SAN LUIS POTOSI","TEAE760114MP","TEAE760114MSPJRT07","ETNA CLEOTILDE DE LA TEJA ARVIZU","24DPT0001U",null,null,null,null,null,null,null,null,null,null,null,null,null,null,null,0,20,0,9957.3199999999979]
[null,"SAN LUIS POTOSI","MEAE5511093F3","MEAE551109HSPNBS06","EUSTOLIO MENDEZ ABAT","24DPT0001U",null,null,null,null,null,null,null,null,null,null,null,null,null,null,null,0,20,0,23807.46]
[null,"SAN LUIS POTOSI","GAWE720429R46","GAWE720429MSPRLV00","EVA GARCIA WILLIAMS","24DPT0001U",null,null,null,null,null,null,null,null,null,null,null,null,null,null,null,0,19,0,12418.18]
[null,"SAN LUIS POTOSI","RARF540425K35","RARF540425HSPMND06","FEDERICO RAMIREZ RINCON","24DPT0009M",null,null,null,null,null,null,null,null,null,null,null,null,null,null,null,0,20,0,15247.649999999989]
[null,"SAN LUIS POTOSI","GUMF450823BM4","GUMF450823HSPRRL02","FELIPE GUERRERO MARTINEZ","24DPT0009M",null,null,null,null,null,null,null,null,null,null,null,null,null,null,null,0,20,0,13792.090000000002]
[null,"SAN LUIS POTOSI","MEMF650811L66","MEMF650811HSPNRL08","FELIPE MENDEZ MORENO","24DPT0005Q",null,null,null,null,null,null,null,null,null,null,null,null,null,null,null,0,20,0,15816.461999999998]
[null,"SAN LUIS POTOSI","LOAF6906051R4","LOAF690605HGTPRL07","FELIX MANUEL LOPEZ ARMAS","24DPT0009M",null,null,null,null,null,null,null,null,null,null,null,null,null,null,null,0,20,0,7200.4862999999996]
[null,"SAN LUIS POTOSI","GOAF5909036G4","GOAF590903HSPNLR01","FERNANDO  GONZALEZ ALMENDAREZ","24DPT0009M",null,null,null,null,null,null,null,null,null,null,null,null,null,null,null,0,20,0,7351.951399999989]
[null,"SAN LUIS POTOSI","RUAF651010QR4","RUAF651010MSPBLR05","FRANCISCA RUBIO ALMARAZ","24DPT0001U",null,null,null,null,null,null,null,null,null,null,null,null,null,null,null,0,20,0,14903.91]
[null,"SAN LUIS POTOSI","NAGF801230EGA","NAGF801230HDFVR06","FRANCISCO NAVARRO GUERRERO","24DPT0001U",null,null,null,null,null,null,null,null,null,null,null,null,null,null,null,0,18,0,5019.45]
[null,"SAN LUIS POTOSI","MOVF710710888","MOVF710710HVZRLR00","FRANCISCO JAVIER MORALES VELAZQUEZ","24DPT0001U",null,null,null,null,null,null,null,null,null,null,null,null,null,null,null,0,20,0,24067.269999999997]
[null,"SAN LUIS POTOSI","ROMF680716254","ROMF680716HSPDRR09","FRANCISCO JAVIER RODRIGUEZ MARQUEZ","24DPT0009M",null,null,null,null,null,null,null,null,null,null,null,null,null,null,null,0,20,0,9309.3004999999903]
[null,"SAN LUIS POTOSI","GOGG5603254M4","GOGG560325HSPNNB00","GABRIEL GONZALEZ GONZALEZ","24DPT0005Q",null,null,null,null,null,null,null,null,null,null,null,null,null,null,null,0,20,0,18480.245599999987]
[null,"SAN LUIS POTOSI","AAMG750317V44","AAMG750317MSPNDB04","GABRIELA ANDRADE MEDINA","24DPT0005Q",null,null,null,null,null,null,null,null,null,null,null,null,null,null,null,0,20,0,19962.88]
[null,"SAN LUIS POTOSI","NALG680106UY1","NALG680106MSPVPB05","GABRIELA NAVARRO LOPEZ","24DPT0009M",null,null,null,null,null,null,null,null,null,null,null,null,null,null,null,0,20,0,7839.7676400000009]
[null,"SAN LUIS POTOSI","SACG841214GZ3","SACG841214MTSLVB06","GABRIELA SALAZAR CAVAZOS","24DPT0001U",null,null,null,null,null,null,null,null,null,null,null,null,null,null,null,0,16,0,4665.21]
[null,"SAN LUIS POTOSI","GAMG8911159U0","GAMG891115HSPRDR02","GARAY MEDELLIN GERMAN","24DPT0003S",null,null,null,null,null,null,null,null,null,null,null,null,null,null,null,0,20,0,5680.07]
[null,"SAN LUIS POTOSI","GASG740126UU3","GASG740126MSPRLD05","GARAY SILVA MARIA GUADALUPE","24DPT0003S",null,null,null,null,null,null,null,null,null,null,null,null,null,null,null,0,20,0,20564.770000000008]
[null,"SAN LUIS POTOSI","GAOJ710130EIA","GAOJ710130HTSRRS06","GARZA ORTEGA JESUS ALBERTO","24DPT0003S",null,null,null,null,null,null,null,null,null,null,null,null,null,null,null,0,20,0,20961.739760000008]
[null,"SAN LUIS POTOSI","TEOG570214T8A","TEOG570214HSPRCR06","GERARDO VALENTIN TREVIÑO OCEJO","24DPT0001U",null,null,null,null,null,null,null,null,null,null,null,null,null,null,null,0,20,0,19141.870000000003]
[null,"SAN LUIS POTOSI","GAEG850702RC1","GAEG850702MSPYSV04","GAYTAN ESQUIVEL GIOVANNA DENNISE","24DPT0007O",null,null,null,null,null,null,null,null,null,null,null,null,null,null,null,0,20,0,17607.53]
[null,"SAN LUIS POTOSI","FOBG800614EZ4","FOBG800614MSPLRS06","GISELA FLORES BARRIENTOS","24DPT0001U",null,null,null,null,null,null,null,null,null,null,null,null,null,null,null,0,20,0,9660.7000000000007]
[null,"SAN LUIS POTOSI","HEGG780128EM4","HEGG780128MDFRNS09","GISELA BEATRIZ HERNANDEZ GONZALEZ","24DPT0001U",null,null,null,null,null,null,null,null,null,null,null,null,null,null,null,0,20,0,9354.7100000000009]
[null,"SAN LUIS POTOSI","HEGG780128EM4","HEGG780128MDFRNS09","GISELA BEATRIZ HERNANDEZ  GONZALEZ","24DPT0001U",null,null,null,null,null,null,null,null,null,null,null,null,null,null,null,0,20,0,65.599999999999994]
[null,"SAN LUIS POTOSI","IAPG671028ED7","IAPG671028MSPRLL04","GLORIA ESTHER  IRACHETA  PALOMINO","24DPT0009M",null,null,null,null,null,null,null,null,null,null,null,null,null,null,null,0,10,0,731.34407999999894]
[null,"SAN LUIS POTOSI","HEGG810522N96","HEGG810522MSPRRL02","GLORIA HILDA HERRERA GARCIA","24DPT0001U",null,null,null,null,null,null,null,null,null,null,null,null,null,null,null,0,18,0,5102.71]
[null,"SAN LUIS POTOSI","GOTA72072926A","GOTA720729HSPNRB00","GONZALEZ TRISTAN ABEL ORLANDO","24DPT0003S",null,null,null,null,null,null,null,null,null,null,null,null,null,null,null,0,20,0,28526.73]
[null,"SAN LUIS POTOSI","GOZF841127IC0","GOZF841127HSPNPR08","GONZALEZ ZAPATA FRANCISCO JAVIER","24DPT0003S",null,null,null,null,null,null,null,null,null,null,null,null,null,null,null,0,20,0,17942.220000000008]
[null,"SAN LUIS POTOSI","SORG4905111P6","SORG490511MSPBMD01","GUADALUPE SOUBERBILLE RAMIREZ","24DPT0009M",null,null,null,null,null,null,null,null,null,null,null,null,null,null,null,0,20,0,4133.5599999999995]
[null,"SAN LUIS POTOSI","CEJG7106259P4","CEJG710625HSPRML04","GUILLERMO CERVANTES JIMENEZ","24DPT0001U",null,null,null,null,null,null,null,null,null,null,null,null,null,null,null,0,20,0,24028.390000000003]
[null,"SAN LUIS POTOSI","NASG680512QM4","NASG680512HSPRNL01","NARVAEZ SANCHEZ GUILLERMO","24DPT0007O",null,null,null,null,null,null,null,null,null,null,null,null,null,null,null,0,20,0,24198.3]
[null,"SAN LUIS POTOSI","ROCG640621IX7","ROCG640621HSPCRL08","GUILLERMO LUIS ROCHA CERDA","24DPT0005Q",null,null,null,null,null,null,null,null,null,null,null,null,null,null,null,0,20,0,12947.955600000001]
[null,"SAN LUIS POTOSI","TUAG691023FZ5","TUAG691023HSPRRS09","GUSTAVO TURRUBIARTES ARMENDARIZ","24DPT0005Q",null,null,null,null,null,null,null,null,null,null,null,null,null,null,null,0,10,0,13188.8]
[null,"SAN LUIS POTOSI","CAGH771105EK2","CAGH771105MSPSZY07","HAYDEE DE JESﾚS CASTILLO GUZMAN","24DPT0001U",null,null,null,null,null,null,null,null,null,null,null,null,null,null,null,0,19,0,2563.71]
[null,"SAN LUIS POTOSI","CAGH771105EK2","CAGH771105MSPSZY07","HAYDEE DE JESÚS CASTILLO GUZMAN","24DPT0001U",null,null,null,null,null,null,null,null,null,null,null,null,null,null,null,0,19,0,2368.4]
[null,"SAN LUIS POTOSI","AAAH620408J7A","AAAH620408HSPLGC09","HECTOR ALVARADO AGUILAR","24DPT0005Q",null,null,null,null,null,null,null,null,null,null,null,null,null,null,null,0,20,0,25935.71]
[null,"SAN LUIS POTOSI","NICH500406FIA","NICH500406HOCCRC04","HECTOR NICOLAS CRUZ","24DPT0005Q",null,null,null,null,null,null,null,null,null,null,null,null,null,null,null,0,20,0,26036.83]
[null,"SAN LUIS POTOSI","MEPH760604A24","MEPH760604HDFNRC07","MENDOZA PEREZ HECTOR ALEJANDRO","24DPT0007O",null,null,null,null,null,null,null,null,null,null,null,null,null,null,null,0,20,0,21481.38]
[null,"SAN LUIS POTOSI","GAOH7907028M8","GAOH790702HSPRRC04","HECTOR LUIS GARCIA  ORTEGA","24DPT0001U",null,null,null,null,null,null,null,null,null,null,null,null,null,null,null,0,20,0,21614.95]
[null,"SAN LUIS POTOSI","HEGF671112HE5","HEGF671112HSPRNR08","HERNANDEZ GONZALEZ FRANCISCO","24DPT0003S",null,null,null,null,null,null,null,null,null,null,null,null,null,null,null,0,20,0,18696.244400000011]
[null,"SAN LUIS POTOSI","HERA661026EM8","HERA661026HSPRYL02","HERNANDEZ REYNA ALEJANDRO","24DPT0003S",null,null,null,null,null,null,null,null,null,null,null,null,null,null,null,0,20,0,23239.80000000001]
[null,"SAN LUIS POTOSI","HERE720801RM4","HERE720801MSPRYS05","HERNANDEZ REYNA MARIA ESPERANZA","24DPT0003S",null,null,null,null,null,null,null,null,null,null,null,null,null,null,null,0,20,0,25372.900000000009]
[null,"SAN LUIS POTOSI","HETM840413SA8","HETM840413HSPRLS05","HERNANDEZ TELLO MOISES","24DPT0003S",null,null,null,null,null,null,null,null,null,null,null,null,null,null,null,0,20,0,11813.601552000011]
[null,"SAN LUIS POTOSI","GAGH690109G27","GAGH690109HTSTRR02","HERNANDO GAITAN  GARCIA","24DPT0005Q",null,null,null,null,null,null,null,null,null,null,null,null,null,null,null,0,20,0,26039.1]
[null,"SAN LUIS POTOSI","BERH801030EA1","BERH801030HSPRBR04","HIRAM ISRAEL BERNAL  ROBLEDO","24DPT0009M",null,null,null,null,null,null,null,null,null,null,null,null,null,null,null,0,20,0,14261.31]
[null,"SAN LUIS POTOSI","TOMI610123MF0","TOMI610123HSPVRL08","TOVAR MARTINEZ ILDEFONSO","24DPT0007O",null,null,null,null,null,null,null,null,null,null,null,null,null,null,null,0,20,0,21685.42]
[null,"SAN LUIS POTOSI","MACI651102HW7","MACI651102MSPRSM05","IMELDA MARQUEZ CISNEROS","24DPT0001U",null,null,null,null,null,null,null,null,null,null,null,null,null,null,null,0,20,0,21502.479999999996]
[null,"SAN LUIS POTOSI","HEBI760906877","HEBI760906MSPRLN03","INDIRA ITZEL HERNANDEZ BLANCO","24DPT0009M",null,null,null,null,null,null,null,null,null,null,null,null,null,null,null,0,20,0,13272.5]
[null,"SAN LUIS POTOSI","NORI770117MK2","NORI770117MVZCYR00","IRANI CRISTAL NOUCHE REYNA","24DPT0009M",null,null,null,null,null,null,null,null,null,null,null,null,null,null,null,0,20,0,9373.7302600000003]
[null,"SAN LUIS POTOSI","MUMI6502099Y1","MUMI650209MPLXRR03","IRMA MUÑOZ MORALES","24DPT0001U",null,null,null,null,null,null,null,null,null,null,null,null,null,null,null,0,20,0,13440.64]
[null,"SAN LUIS POTOSI","REAI680404G22","REAI680404MSPYGR02","IRMA REYES AGUILAR","24DPT0001U",null,null,null,null,null,null,null,null,null,null,null,null,null,null,null,0,20,0,5498.6200000000008]
[null,"SAN LUIS POTOSI","OONI7406107B6","OONI740610MSPRRS07","ISABEL OROZCO NARVAEZ","24DPT0005Q",null,null,null,null,null,null,null,null,null,null,null,null,null,null,null,0,20,0,16139.204900000008]
[null,"SAN LUIS POTOSI","GUMI730706SB1","GUMI730706HSPRNS01","ISAIAS GUERRERO MONZON","24DPT0001U",null,null,null,null,null,null,null,null,null,null,null,null,null,null,null,0,20,0,16473.149999999998]
[null,"SAN LUIS POTOSI","GOHI7107157V2","GOHI710715MTSNRX03","IXCHEL GONZALEZ HERNANDEZ","24DPT0001U",null,null,null,null,null,null,null,null,null,null,null,null,null,null,null,0,20,0,23986.059999999994]
[null,"SAN LUIS POTOSI","AURC720705LI8","AURC720705HSPGDR08","J. CRUZ FRANCISCO AGUILLON RODRIGUEZ","24DPT0009M",null,null,null,null,null,null,null,null,null,null,null,null,null,null,null,0,20,0,11653.909999999987]
[null,"SAN LUIS POTOSI","GAAJ560927TMA","GAAJ560927HZSLLS17","J. JESUS GALVAN ALVAREZ","24DPT0009M",null,null,null,null,null,null,null,null,null,null,null,null,null,null,null,0,20,0,7201.0700000000006]
[null,"SAN LUIS POTOSI","MASJ701225MPA","MASJ701225MSPRNC05","JACQUELINE MARQUEZ SANCHEZ","24DPT0005Q",null,null,null,null,null,null,null,null,null,null,null,null,null,null,null,0,20,0,12536.569199999989]
[null,"SAN LUIS POTOSI","AERJ5601224J5","AERJ560122HZSCDM02","JAIME ACEVEDO  RODRIGUEZ","24DPT0009M",null,null,null,null,null,null,null,null,null,null,null,null,null,null,null,0,20,0,10798.17]
[null,"SAN LUIS POTOSI","JISJ781111I10","JISJ781111MSPMLN01","JANI ARELI JIMENEZ SILVA","24DPT0009M",null,null,null,null,null,null,null,null,null,null,null,null,null,null,null,0,20,0,16094.720000000003]
[null,"SAN LUIS POTOSI","FOAJ440312DR1","FOAJ440312HSPLLV01","JAVIER FLORES ALVARADO","24DPT0009M",null,null,null,null,null,null,null,null,null,null,null,null,null,null,null,0,20,0,14910.750000000011]
[null,"SAN LUIS POTOSI","ROGJ611105BLA","ROGJ611005HSPCVV07","JAVIER ROCHA GUEVARA","24DPT0005Q",null,null,null,null,null,null,null,null,null,null,null,null,null,null,null,0,20,0,26425.249999999993]
[null,"SAN LUIS POTOSI","CURJ7011068Y1","CURJ701106HSPRVV00","CRUZ RIVERA JAVIER LEONARDO","24DPT0007O",null,null,null,null,null,null,null,null,null,null,null,null,null,null,null,0,20,0,15459.96]
[null,"SAN LUIS POTOSI","ROAJ780411149","ROAJ780411HSPDVV15","JAVIER VLADIMIR RODRIGUEZ  AVALOS","24DPT0005Q",null,null,null,null,null,null,null,null,null,null,null,null,null,null,null,0,20,0,17184.419999999998]
[null,"SAN LUIS POTOSI","BIBJ740611411","BIBJ740611MDFRCR01","JERITZIA BRIONES BECERRIL","24DPT0005Q",null,null,null,null,null,null,null,null,null,null,null,null,null,null,null,0,20,0,22712.629999999997]
[null,"SAN LUIS POTOSI","RASJ510626SU0","RASJ510626HSPMLS08","JESUS RAMIREZ SALDAÑA","24DPT0005Q",null,null,null,null,null,null,null,null,null,null,null,null,null,null,null,0,20,0,15138.559999999998]
[null,"SAN LUIS POTOSI","JIMF880612N96","JIMF880612HSPMLR02","JIMENEZ MALDONADO FRANCISCO ANTONIO","24DPT0003S",null,null,null,null,null,null,null,null,null,null,null,null,null,null,null,0,12,0,8727.0300000000007]
[null,"SAN LUIS POTOSI","AEBJ400825AUA","AEBJ400825HDFRLL08","JOEL ARMENDARIZ BLAZQUEZ","24DPT0009M",null,null,null,null,null,null,null,null,null,null,null,null,null,null,null,0,20,0,16312.560000000001]
[null,"SAN LUIS POTOSI","JADJ611209J81","JADJ611209HSPSZL06","JOEL JASSO DIAZ DE LEON","24DPT0005Q",null,null,null,null,null,null,null,null,null,null,null,null,null,null,null,0,20,0,23233.999999999996]
[null,"SAN LUIS POTOSI","GAHJ5112239S7","GAHJ511223HDFRRR08","JORGE GARCIA  HUERTA","24DPT0005Q",null,null,null,null,null,null,null,null,null,null,null,null,null,null,null,0,20,0,22775.510000000002]
[null,"SAN LUIS POTOSI","LIVJ720505VE3","LIVJ720505HTSMLR07","JORGE ALBERTO LIMON VILLANUEVA","24DPT0001U",null,null,null,null,null,null,null,null,null,null,null,null,null,null,null,0,20,0,23246.780000000002]
[null,"SAN LUIS POTOSI","MEPJ741216UT6","MEPJ741216HDFNRR09","MENDOZA PEREZ JORGE ALBERTO","24DPT0007O",null,null,null,null,null,null,null,null,null,null,null,null,null,null,null,0,20,0,21502.829999999994]
[null,"SAN LUIS POTOSI","EIGJ460405L10","EIGJ460405HHGSRR06","JORGE VICENTE ESPINOLA GARCIA","24DPT0009M",null,null,null,null,null,null,null,null,null,null,null,null,null,null,null,0,20,0,13724.699999999999]
[null,"SAN LUIS POTOSI","GOMJ610824C57","GOMJ610824HSPNRS00","JOSE GONZALEZ MARQUEZ","24DPT0005Q",null,null,null,null,null,null,null,null,null,null,null,null,null,null,null,0,20,0,26056.429999999997]
[null,"SAN LUIS POTOSI","GAGA480307S50","GAGA480307HSPSND09","JOSE ADRIAN GASCA GONZALEZ","24DPT0009M",null,null,null,null,null,null,null,null,null,null,null,null,null,null,null,0,20,0,7246.8188000000009]
[null,"SAN LUIS POTOSI","VARA690110SH8","VARA690110HSPRMN02","JOSE ANGEL VARGAS RAMIREZ","24DPT0009M",null,null,null,null,null,null,null,null,null,null,null,null,null,null,null,0,20,0,17999.739999999998]
[null,"SAN LUIS POTOSI","CUHA760315EI9","CUHA760315HSPLRN00","CUELLAR HUERTA JOSE ANTONIO","24DPT0007O",null,null,null,null,null,null,null,null,null,null,null,null,null,null,null,0,10,0,12216.710000000001]
[null,"SAN LUIS POTOSI","DIPA460121GU5","DIPA460121HSPZDN04","JOSE ANTONIO DIAZ  PEDROZA","24DPT0009M",null,null,null,null,null,null,null,null,null,null,null,null,null,null,null,0,10,0,11839.53]
[null,"SAN LUIS POTOSI","MAAA8603143Z2","MAAA860314HSPRLN07","JOSE ANTONIO MARTINEZ ALVARADO","24DPT0009M",null,null,null,null,null,null,null,null,null,null,null,null,null,null,null,0,20,0,13905.600000000002]
[null,"SAN LUIS POTOSI","RESA7310259T4","RESA731025HSPYRN09","JOSE ANTONIO REYES SORIA","24DPT0005Q",null,null,null,null,null,null,null,null,null,null,null,null,null,null,null,0,5,0,6815.18]
[null,"SAN LUIS POTOSI","MAGC760229LNA","MAGC760229HSPRLR06","JOSE CIRILO MARTINEZ GUEL","24DPT0005Q",null,null,null,null,null,null,null,null,null,null,null,null,null,null,null,0,11,0,16673.179999999997]
[null,"SAN LUIS POTOSI","MOGC610503EQ7","MOGC610503HSPRRR03","JOSE CRUZ MORENO  GUERRERO","24DPT0009M",null,null,null,null,null,null,null,null,null,null,null,null,null,null,null,0,20,0,8005.1183919999967]
[null,"SAN LUIS POTOSI","GAMJ740817IB0  ","GAMJ740817HSPRXS06","JOSE DE JESUS GARCIA  MUÑIZ","24DPT0005Q",null,null,null,null,null,null,null,null,null,null,null,null,null,null,null,0,20,0,25309.689999999988]
[null,"SAN LUIS POTOSI","MOMJ8212233P","MOMJ821223HSPTRS09","JOSE DE JESUS MOTA MARTINEZ","24DPT0005Q",null,null,null,null,null,null,null,null,null,null,null,null,null,null,null,0,20,0,8728.27]
[null,"SAN LUIS POTOSI","CARL4406129D4","CARL440612HSPNDS00","JOSE DE JESUS L. CANDELARIA RODRIGUEZ ","24DPT0005Q",null,null,null,null,null,null,null,null,null,null,null,null,null,null,null,0,20,0,24470.01]
[null,"SAN LUIS POTOSI","MAHL760517HSP","MAHL760517HSPRRZ08","JOSE DE LA LUZ MARTINEZ HERNANDEZ","24DPT0005Q",null,null,null,null,null,null,null,null,null,null,null,null,null,null,null,0,20,0,20176.54]
[null,"SAN LUIS POTOSI","BAME661107RG9","BAME661107HSPLCR00","JOSE ERNESTO BALDERAS MOCTEZUMA","24DPT0005Q",null,null,null,null,null,null,null,null,null,null,null,null,null,null,null,0,20,0,21415.219999999998]
[null,"SAN LUIS POTOSI","SASG591128V18","SASG591128HSPNLD09","JOSE GUADALUPE SANCHEZ SILVA","24DPT0009M",null,null,null,null,null,null,null,null,null,null,null,null,null,null,null,0,20,0,11571.784999999998]
[null,"SAN LUIS POTOSI","RAMJ530309U28","RAMJ530309HSPMNN00","JOSE JUAN RAMIREZ MENDEZ","24DPT0009M",null,null,null,null,null,null,null,null,null,null,null,null,null,null,null,0,20,0,16783.692071999998]
[null,"SAN LUIS POTOSI","EAAL600305LZ9","EAAL600305HCHSLS03","JOSE LUIS ESCAMILLA ALVARADO","24DPT0009M",null,null,null,null,null,null,null,null,null,null,null,null,null,null,null,0,20,0,15300.52]
[null,"SAN LUIS POTOSI","JAML440222QT9","JAML440222HDFMRS07","JOSE LUIS JAIMES MURILLO","24DPT0009M",null,null,null,null,null,null,null,null,null,null,null,null,null,null,null,0,20,0,12469.228999999999]
[null,"SAN LUIS POTOSI","OOSL700110939","OOSL700110HSPLLS06","JOSE LUIS OLMOS SALINAS","24DPT0005Q",null,null,null,null,null,null,null,null,null,null,null,null,null,null,null,0,20,0,24302.589999999993]
[null,"SAN LUIS POTOSI","PEDL500618HKA","PEDL500618HASRRS04","JOSE LUIS PERALES DURAN","24DPT0009M",null,null,null,null,null,null,null,null,null,null,null,null,null,null,null,0,10,0,8394.52]
[null,"SAN LUIS POTOSI","PETL610331JG9","PETL610331HSPRRS06","PEREZ TERAN JOSE LUIS","24DPT0007O",null,null,null,null,null,null,null,null,null,null,null,null,null,null,null,0,16,0,15024.23]
[null,"SAN LUIS POTOSI","ZAEL5605308Z2","ZAEL560530HSPPSS02","JOSE LUIS ZAPATA ESQUIVEL","24DPT0005Q",null,null,null,null,null,null,null,null,null,null,null,null,null,null,null,0,20,0,22028.07]
[null,"SAN LUIS POTOSI","EALM760403GUA","EALM760403HZSSYN09","ESPARZA LEYVA JOSE MANUEL","24DPT0007O",null,null,null,null,null,null,null,null,null,null,null,null,null,null,null,0,20,0,21287.440000000002]
[null,"SAN LUIS POTOSI","MEMM7906135N1","MEMM790613HSPLRN13","MELCHOR MORENO JOSE MANUEL","24DPT0007O",null,null,null,null,null,null,null,null,null,null,null,null,null,null,null,0,20,0,15076.99]
[null,"SAN LUIS POTOSI","SETM681012ASA","SETM681012HSPRRR01","JOSE MARTIN SERNA TORRES","24DPT0009M",null,null,null,null,null,null,null,null,null,null,null,null,null,null,null,0,20,0,10597.640017999998]
[null,"SAN LUIS POTOSI","GUMR6108145QI","GUMR610814HSPRXM05","JOSE RAMON GUERRERO  MUÑOZ","24DPT0005Q",null,null,null,null,null,null,null,null,null,null,null,null,null,null,null,0,20,0,7570.8739999999998]
[null,"SAN LUIS POTOSI","FAMR5611097XA","FAMR561109HSPZLY02","JOSE REYNALDO FAZ MELENDEZ","24DPT0005Q",null,null,null,null,null,null,null,null,null,null,null,null,null,null,null,0,20,0,19104.670000000002]
[null,"SAN LUIS POTOSI","HEJV660214BB3","HEJV660214HSPRRL02","JOSE VALENTIN HERNANDEZ JARA","24DPT0009M",null,null,null,null,null,null,null,null,null,null,null,null,null,null,null,0,20,0,258.25735999998915]
[null,"SAN LUIS POTOSI","OAGV7608069K8","OAGV760806HSPXRC03","OÑATE GARCIA JOSE VICTOR","24DPT0007O",null,null,null,null,null,null,null,null,null,null,null,null,null,null,null,0,20,0,18154.760000000002]
[null,"SAN LUIS POTOSI","CEGJ59031222A","CEGJ590312MSPRRS11","JOSEFINA CERDA GARCIA","24DPT0009M",null,null,null,null,null,null,null,null,null,null,null,null,null,null,null,0,20,0,10330.330099999999]
[null,"SAN LUIS POTOSI","REAJ550308GR7","REAJ550308HMCYLN03","JUAN REYES  ALANIS","24DPT0005Q",null,null,null,null,null,null,null,null,null,null,null,null,null,null,null,0,20,0,25052.57]
[null,"SAN LUIS POTOSI","GOMJ530811FX9","GOMJ530811HSPDRN03","JUAN ANTONIO GODINEZ MARTINEZ","24DPT0009M",null,null,null,null,null,null,null,null,null,null,null,null,null,null,null,0,20,0,10981.290000000003]
[null,"SAN LUIS POTOSI","GURJ631108BU2","GURJ631108HSPRYN00","JUAN ANTONIO GUERRERO  REYNA","24DPT0005Q",null,null,null,null,null,null,null,null,null,null,null,null,null,null,null,0,20,0,23920.42]
[null,"SAN LUIS POTOSI","LOAJ8607033W0","LOAJ860703HSPPVN06","LOPEZ AVILA JUAN DAVID","24DPT0007O",null,null,null,null,null,null,null,null,null,null,null,null,null,null,null,0,20,0,14471.880000000001]
[null,"SAN LUIS POTOSI","MUGJ740814TR0","MUGJ470814HDFXNN07","JUAN JESUS MUÑOZ GONZALEZ","24DPT0005Q",null,null,null,null,null,null,null,null,null,null,null,null,null,null,null,0,20,0,22504.48]
[null,"SAN LUIS POTOSI","RUAJ780917EP9","RUAJ780917HSPBRN09","JUAN JESUS RUBIO ARTEAGA","24DPT0001U",null,null,null,null,null,null,null,null,null,null,null,null,null,null,null,0,20,0,14734.830000000004]
[null,"SAN LUIS POTOSI","MATJ820624PE6","MATJ820624HSPRRN11","MARTINEZ TORRES JUAN MANUEL","24DPT0007O",null,null,null,null,null,null,null,null,null,null,null,null,null,null,null,0,20,0,19599.489999999998]
[null,"SAN LUIS POTOSI","LOMJ711030F60","LOMJ711030HSPPYN03","JUAN MARTIN LOPEZ MAYORGA","24DPT0001U",null,null,null,null,null,null,null,null,null,null,null,null,null,null,null,0,20,0,22646.080000000002]
[null,"SAN LUIS POTOSI","EAVJ7402025Q6","EAVJ740202HSPSRN00","JUAN PATRICIO ESCAMILLA VARGAS","24DPT0001U",null,null,null,null,null,null,null,null,null,null,null,null,null,null,null,0,20,0,12576.01]
[null,"SAN LUIS POTOSI","COHJ580113A73","COHJ580113MMCRRN07","JUANA EVA CORDOVA HERNANDEZ","24DPT0001U",null,null,null,null,null,null,null,null,null,null,null,null,null,null,null,0,20,0,23769.399999999994]
[null,"SAN LUIS POTOSI","GUHJ580201NN2","GUHJ580201MSPTRN07","JUANA ROSALBA GUTIERREZ HUERTA","24DPT0009M",null,null,null,null,null,null,null,null,null,null,null,null,null,null,null,0,20,0,15541.07]
[null,"SAN LUIS POTOSI","SIRJ740930AC0","SIRJ740930HCLLDL04","JULIAN SILOS RODRIGUEZ","24DPT0009M",null,null,null,null,null,null,null,null,null,null,null,null,null,null,null,0,20,0,6145.7345599999971]
[null,"SAN LUIS POTOSI","VINJ740730LS5","VINJ740730MSPTYL00","JULIETA VITALES NOYOLA","24DPT0001U",null,null,null,null,null,null,null,null,null,null,null,null,null,null,null,0,20,0,15494.23]
[null,"SAN LUIS POTOSI","AEGJ710415S84","AEGJ710415HSPLML00","JULIO ALMENDAREZ GOMEZ","24DPT0005Q",null,null,null,null,null,null,null,null,null,null,null,null,null,null,null,0,20,0,18549.322599999996]
[null,"SAN LUIS POTOSI","MARJ770923516","MARJ770923HSPTML00","JULIO CESAR MATEOS ROMERO","24DPT0001U",null,null,null,null,null,null,null,null,null,null,null,null,null,null,null,0,20,0,14549.43]
[null,"SAN LUIS POTOSI","PEGJ790701TZ6","PEGJ790701HASRNL07","PEREZ GONZALEZ JULIO CESAR","24DPT0007O",null,null,null,null,null,null,null,null,null,null,null,null,null,null,null,0,20,0,16837.670000000002]
[null,"SAN LUIS POTOSI","GOAK791020NR5","GOAK791020MSPNBR02","KARLA GONZALEZ ABUNDIS","24DPT0009M",null,null,null,null,null,null,null,null,null,null,null,null,null,null,null,0,20,0,13130.979999999998]
[null,"SAN LUIS POTOSI","GODK860424TX9","GODK860424MSPNZR01","GONZALEZ DIAZ KARLA BEATRIZ","24DPT0007O",null,null,null,null,null,null,null,null,null,null,null,null,null,null,null,0,20,0,17253.909999999996]
[null,"SAN LUIS POTOSI","COAL690815CZ6","COAL690815MSPRRR09","LAURA CORTES ARRIAGA","24DPT0009M",null,null,null,null,null,null,null,null,null,null,null,null,null,null,null,0,20,0,18228.179999999997]
[null,"SAN LUIS POTOSI","GAAL650815RR2","GAAL650815MSPLMR09","LAURA GALLARDO DEL ANGEL","24DPT0001U",null,null,null,null,null,null,null,null,null,null,null,null,null,null,null,0,20,0,22199.25]
[null,"SAN LUIS POTOSI","SAML701004NU0","SAML701004MSPLRR09","LAURA GEORGINA SALAS MART1NEZ","24DPT0005Q",null,null,null,null,null,null,null,null,null,null,null,null,null,null,null,0,20,0,25796.879999999997]
[null,"SAN LUIS POTOSI","CAML790315LT5","CALM790315MSPRLR01","LAURA GRISELDA CARLOS MELCHOR","24DPT0005Q",null,null,null,null,null,null,null,null,null,null,null,null,null,null,null,0,12,0,15436.869999999999]
[null,"SAN LUIS POTOSI","GOLL770316DG2","GOLL770316MSPNPR02","LAURA PATRICIA GONZALEZ LOPEZ","24DPT0009M",null,null,null,null,null,null,null,null,null,null,null,null,null,null,null,0,20,0,7194.1333999999979]
[null,"SAN LUIS POTOSI","AACL421108AB7","AACL421108HSPLBN03","ALANIS CABRERA LENIN ARNULFO","24DPT0007O",null,null,null,null,null,null,null,null,null,null,null,null,null,null,null,0,20,0,24521.55]
[null,"SAN LUIS POTOSI","RURL781116QJ9","RURL781116MSPZJN07","LEONOR ORLEM RUIZ  ROJAS","24DPT0001U",null,null,null,null,null,null,null,null,null,null,null,null,null,null,null,0,20,0,19328.27]
[null,"SAN LUIS POTOSI","GOFL680327B85","GOFL680327MSPNLT04","LETICIA GONZALEZ FLORES","24DPT0001U",null,null,null,null,null,null,null,null,null,null,null,null,null,null,null,0,20,0,15009.39]
[null,"SAN LUIS POTOSI","VEML550517KBA","VEML550517MSPLRT04","LETICIA VELAZQUEZ MORALES","24DPT0009M",null,null,null,null,null,null,null,null,null,null,null,null,null,null,null,0,20,0,7215.130000000001]
[null,"SAN LUIS POTOSI","GAHL630515KS3","GAHL630515MSPRRL02","LILIA GARCIA  HERNANDEZ","24DPT0001U",null,null,null,null,null,null,null,null,null,null,null,null,null,null,null,0,20,0,8594.2099999999991]
[null,"SAN LUIS POTOSI","LOCJ6708117Q7","LOCJ670811HSPPHR01","LOPEZ CHAVEZ JORGE LUIS","24DPT0003S",null,null,null,null,null,null,null,null,null,null,null,null,null,null,null,0,20,0,21297.739999999998]
[null,"SAN LUIS POTOSI","LOVL781118RQ2","LOVL781118HSPPLS07","LOPEZ VELEZ LUIS ANGEL","24DPT0003S",null,null,null,null,null,null,null,null,null,null,null,null,null,null,null,0,20,0,13313.625520000011]
[null,"SAN LUIS POTOSI","LOOI630403PR0","LOOI630403HSPRBS07","LOREDO OBREGON ISRAEL","24DPT0003S",null,null,null,null,null,null,null,null,null,null,null,null,null,null,null,0,20,0,19140.664000000001]
[null,"SAN LUIS POTOSI","CEAL770411QU7","CEAL770411MSPRLR06","LORENA CERVANTES  ALMENDAREZ","24DPT0005Q",null,null,null,null,null,null,null,null,null,null,null,null,null,null,null,0,20,0,22594.800000000003]
[null,"SAN LUIS POTOSI","IASL4403122B2","IASL440312HSPZLC11","LUCAS  IZAGUIRRE SILVA","24DPT0009M",null,null,null,null,null,null,null,null,null,null,null,null,null,null,null,0,20,0,14962.840000000002]
[null,"SAN LUIS POTOSI","RARL5606213B1","RARL560621HSPMNS06","RAMIREZ RINCON LUIS","24DPT0007O",null,null,null,null,null,null,null,null,null,null,null,null,null,null,null,0,20,0,23680.1]
[null,"SAN LUIS POTOSI","FOHL830720SP9","FOHL830720HSPLRS01","FLORES HERNANDEZ LUIS ENRIQUE","24DPT0007O",null,null,null,null,null,null,null,null,null,null,null,null,null,null,null,0,20,0,18494.77]
[null,"SAN LUIS POTOSI","NAPL890330BAA","NAPL890330HSPVYS01","LUIS ERICK NAVARRO PAYTA","24DPT0001U",null,null,null,null,null,null,null,null,null,null,null,null,null,null,null,0,19,0,5298.7199999999993]
[null,"SAN LUIS POTOSI","RITL670216PK2","RITL670216HSPVRS00","LUIS FERNANDO RIVERA TURRUBIARTES","24DPT0009M",null,null,null,null,null,null,null,null,null,null,null,null,null,null,null,0,20,0,15661.9]
[null,"SAN LUIS POTOSI","RAYL6402118J6","RAYL640211MSPMXZ05","LUZ ELENA RAMIREZ YAÑEZ","24DPT0009M",null,null,null,null,null,null,null,null,null,null,null,null,null,null,null,0,20,0,12037.71999999999]
[null,"SAN LUIS POTOSI","HENF580407SM5","HENF580407MTSRTT02","MA. DE FATIMA HERRERA NIETO","24DPT0001U",null,null,null,null,null,null,null,null,null,null,null,null,null,null,null,0,20,0,15877.650000000001]
[null,"SAN LUIS POTOSI","MOGL751224U33","MOGL751224MSPRLR02","MORALES GALICIA MA. DE LOURDES","24DPT0007O",null,null,null,null,null,null,null,null,null,null,null,null,null,null,null,0,14,0,3778.2899999999991]
[null,"SAN LUIS POTOSI","AAEC701030QT9","AAEC701030MDFNSN09","MA. DEL CONSUELO ANASTACIO ESTEFES","24DPT0001U",null,null,null,null,null,null,null,null,null,null,null,null,null,null,null,0,20,0,23233.439999999999]
[null,"SAN LUIS POTOSI","COCE520817DA6","COCE520817MSPRSL06","MA. ELENA CORDOVA CASTILLO","24DPT0001U",null,null,null,null,null,null,null,null,null,null,null,null,null,null,null,0,20,0,13424.88]
[null,"SAN LUIS POTOSI","GUNG7012058H2","GUNG701205MSPRYD06","MA. GUADALUPE GUERRERO  NOYOLA","24DPT0005Q",null,null,null,null,null,null,null,null,null,null,null,null,null,null,null,0,20,0,24524.53999999999]
[null,"SAN LUIS POTOSI","MOVG651124QZ2","MOVG651124MTSRZD06","MA. GUADALUPE MORALES VAZQUEZ","24DPT0001U",null,null,null,null,null,null,null,null,null,null,null,null,null,null,null,0,12,0,16261.550000000001]
[null,"SAN LUIS POTOSI","LOHJ6210136P8","LOHJ621013MSPPRV08","MA. JOVITA LOPEZ HERNANDEZ","24DPT0009M",null,null,null,null,null,null,null,null,null,null,null,null,null,null,null,0,20,0,9192.16]
[null,"SAN LUIS POTOSI","COLL581114DC8","COLL581114MSPMPS09","MA. LUISA COMPEAN LOPEZ","24DPT0001U",null,null,null,null,null,null,null,null,null,null,null,null,null,null,null,0,20,0,23705.579999999998]
[null,"SAN LUIS POTOSI","EAHM671124PBA","EAHM671124MTSSRG07","MAGALY ESTRADA HERNANDEZ","24DPT0009M",null,null,null,null,null,null,null,null,null,null,null,null,null,null,null,0,20,0,8324.2262999999894]
[null,"SAN LUIS POTOSI","DIDM570116BV9","DIDM570116MSPZVR09","MARCELA IMELDA DIAZ DAVILA","24DPT0009M",null,null,null,null,null,null,null,null,null,null,null,null,null,null,null,0,20,0,13691.329999999998]
[null,"SAN LUIS POTOSI","CUFM730703JL2","CUFM730703HSPNNR00","MARCO ANTONIO CUENDIA FUENTES","24DPT0001U",null,null,null,null,null,null,null,null,null,null,null,null,null,null,null,0,20,0,15565.16]
[null,"SAN LUIS POTOSI","DAPM8512312R5","DAPM851231HSPVZR07","DAVALOS PAEZ MARCO ANTONIO","24DPT0007O",null,null,null,null,null,null,null,null,null,null,null,null,null,null,null,0,18,0,15820.24]
[null,"SAN LUIS POTOSI","MOSM5107184H6","MOSM510718HSPSVR01","MARCO ANTONIO MONSIVAIS SAAVEDRA","24DPT0009M",null,null,null,null,null,null,null,null,null,null,null,null,null,null,null,0,20,0,17293.79]
[null,"SAN LUIS POTOSI","GOGM750520AD8","GOGM750520HSPNRR07","GONZALEZ GUERRA MARCO TULIO","24DPT0007O",null,null,null,null,null,null,null,null,null,null,null,null,null,null,null,0,20,0,21760.69]
[null,"SAN LUIS POTOSI","DERA630916TV7","DERA630916MSLLDL09","MARIA ALICIA DELGADO  RODRIGUEZ","24DPT0001U",null,null,null,null,null,null,null,null,null,null,null,null,null,null,null,0,20,0,26485.459999999995]
[null,"SAN LUIS POTOSI","MEDA710331LD8","MEDA710331MSPLZR07","MARIA ARACELI MELCHOR DIAZ DE LEON","24DPT0005Q",null,null,null,null,null,null,null,null,null,null,null,null,null,null,null,0,20,0,11969.720000000001]
[null,"SAN LUIS POTOSI","DESC5311153R9","DESC531115MSPLVR05","MARIA DEL CARMEN DELGADO SAAVEDRA","24DPT0009M",null,null,null,null,null,null,null,null,null,null,null,null,null,null,null,0,20,0,17810.009999999998]
[null,"SAN LUIS POTOSI","VILR551117J86","VILR551117MSPLNS02","MARIA DEL ROSARIO VILLA DE LEON","24DPT0005Q",null,null,null,null,null,null,null,null,null,null,null,null,null,null,null,0,20,0,25643.549999999996]
[null,"SAN LUIS POTOSI","ZAHS690627LN1","ZAHS690627MSPVRC02","MARIA DEL SOCORRO ZAVALA  HERNANDEZ","24DPT0009M",null,null,null,null,null,null,null,null,null,null,null,null,null,null,null,0,20,0,14643.089999999987]
[null,"SAN LUIS POTOSI","LASE7210152Z4","LASE721015MSPRLL05","MARIA ELIZABETH LARA SALAZAR","24DPT0005Q",null,null,null,null,null,null,null,null,null,null,null,null,null,null,null,0,20,0,26314.419999999984]
[null,"SAN LUIS POTOSI","MOHE770612FA9","MOHE770612MSPNRM06","MARIA EMILIA MONREAL HERNANDEZ","24DPT0005Q",null,null,null,null,null,null,null,null,null,null,null,null,null,null,null,0,20,0,14029.229200000002]
[null,"SAN LUIS POTOSI","VEGE630912DG6","VEGE630912MSPGRM06","MARIA ESTELA VEGA GUERRERO","24DPT0005Q",null,null,null,null,null,null,null,null,null,null,null,null,null,null,null,0,20,0,24951.929399999997]
[null,"SAN LUIS POTOSI","GACG681201AW1","GACG681201MSPLSR09","MARIA GRISELDA GALVAN CASTRO","24DPT0009M",null,null,null,null,null,null,null,null,null,null,null,null,null,null,null,0,20,0,10928.700999999999]
[null,"SAN LUIS POTOSI","PIPG620110UQ4","PIPG620110MCSNLD07","MARIA GUADALUPE PINEDA PALOMEQUE","24DPT0009M",null,null,null,null,null,null,null,null,null,null,null,null,null,null,null,0,20,0,9946.329999999989]
[null,"SAN LUIS POTOSI","POLG541025AQ5","POLG541025MSPZRD06","MARIA GUADALUPE POZOS LARRAGA","24DPT0001U",null,null,null,null,null,null,null,null,null,null,null,null,null,null,null,0,20,0,20196.969999999998]
[null,"SAN LUIS POTOSI","AAMI700628346","AAMI700628MSPYNS03","MARIA ISABEL AYALA  MANRIQUE","24DPT0009M",null,null,null,null,null,null,null,null,null,null,null,null,null,null,null,0,20,0,11324.374499999998]
[null,"SAN LUIS POTOSI","TOMI610628R81","TOMI610628MSPRNS04","MARIA ISABEL TORRES MONTERO","24DPT0009M",null,null,null,null,null,null,null,null,null,null,null,null,null,null,null,0,20,0,15260.960000000003]
[null,"SAN LUIS POTOSI","LEGP7009225B7","LEGP700922MSPRNT06","MARIA PATRICIA LEURA GONZALEZ","24DPT0009M",null,null,null,null,null,null,null,null,null,null,null,null,null,null,null,0,20,0,19549.209999999988]
[null,"SAN LUIS POTOSI","TORP620614DL8","TORP620614MTSRMT07","MARIA PATRICIA TORRES ROMERO","24DPT0001U",null,null,null,null,null,null,null,null,null,null,null,null,null,null,null,0,20,0,16636.61]
[null,"SAN LUIS POTOSI","PEMT680208272","PEMT680208MSPXZR07","PEÑA DE LA MAZA MARIA TERESA DE JESUS","24DPT0007O",null,null,null,null,null,null,null,null,null,null,null,null,null,null,null,0,20,0,25440.21]
[null,"SAN LUIS POTOSI","LEGV7511103D7","LEGV751110MSPJMC08","MARIA VICTORIA LEIJA GAMEZ","24DPT0005Q",null,null,null,null,null,null,null,null,null,null,null,null,null,null,null,0,20,0,18134.269199999995]
[null,"SAN LUIS POTOSI","HEMM741229CT4","HEMM741229MSPRTR00","MARICELA HERNANDEZ MATA","24DPT0005Q",null,null,null,null,null,null,null,null,null,null,null,null,null,null,null,0,20,0,23997.839999999989]
[null,"SAN LUIS POTOSI","TOCM570613U68","TOCM570613MSPRRR08","MARICELA TORRES CRUZ","24DPT0001U",null,null,null,null,null,null,null,null,null,null,null,null,null,null,null,0,20,0,15859.419999999998]
[null,"SAN LUIS POTOSI","EACM730411FGA","EACM730411MSPSRR00","MARISELA ESPARZA CERDA","24DPT0005Q",null,null,null,null,null,null,null,null,null,null,null,null,null,null,null,0,20,0,15632.997519999999]
[null,"SAN LUIS POTOSI","AOMM570312AV4","AOMM570312MSPLDR05","MARTHA ALONSO MEDELLIN","24DPT0005Q",null,null,null,null,null,null,null,null,null,null,null,null,null,null,null,0,20,0,16880.599399999999]
[null,"SAN LUIS POTOSI","CARM5007227Y1","CARM500722MSPMGR08","MARTHA EUGENIA CAMACHO  REGALADO","24DPT0001U",null,null,null,null,null,null,null,null,null,null,null,null,null,null,null,0,20,0,24142.86]
[null,"SAN LUIS POTOSI","PIPM7007029U3","PIPM700702HOCNLR01","MARTIN OTHON PINEDA PALOMEQUE","24DPT0009M",null,null,null,null,null,null,null,null,null,null,null,null,null,null,null,0,20,0,5570.2127719999971]
[null,"SAN LUIS POTOSI","COHM800901KC1","COHM800901MSPRRR06","MARY CRUZ CORDOVA HERNANDEZ","24DPT0009M",null,null,null,null,null,null,null,null,null,null,null,null,null,null,null,0,20,0,9252.218099999991]
[null,"SAN LUIS POTOSI","VAAM801130154","VAAM801130MSPZRR08","MARY LINDA VAZQUEZ ARIAS","24DPT0009M",null,null,null,null,null,null,null,null,null,null,null,null,null,null,null,0,20,0,6745.197899999991]
[null,"SAN LUIS POTOSI","QUMM721121LP","QUMM721121MSPNRR03","QUINTANILLA MARTINEZ MAURA REBECA","24DPT0007O",null,null,null,null,null,null,null,null,null,null,null,null,null,null,null,0,20,0,23883.42]
[null,"SAN LUIS POTOSI","MEMA921014HSP","MEMA921014HSPDDL09","MEDELLIN MEDRANO ALEJANDRO","24DPT0003S",null,null,null,null,null,null,null,null,null,null,null,null,null,null,null,0,18,0,9153.6299999999992]
[null,"SAN LUIS POTOSI","MERA670804NV8","MERA670804HSPDNL04","MEDELLIN RANGEL ALEJO","24DPT0003S",null,null,null,null,null,null,null,null,null,null,null,null,null,null,null,0,20,0,25357.009999999991]
[null,"SAN LUIS POTOSI","TOSM760208363","TOSM760802HSPRLG04","MIGUEL TORRES SALDAÑA","24DPT0005Q",null,null,null,null,null,null,null,null,null,null,null,null,null,null,null,0,20,0,22608.519999999997]
[null,"SAN LUIS POTOSI","VAPM690514RM6","VAPM690514MSPRRR03","MIREYA VAZQUEZ PIZAÑO","24DPT0001U",null,null,null,null,null,null,null,null,null,null,null,null,null,null,null,0,20,0,14133.229999999998]
[null,"SAN LUIS POTOSI","FOHM790707DH8","FOHM790707MSPLRN07","FLORES HERNANDEZ MONICA JAZMIN","24DPT0007O",null,null,null,null,null,null,null,null,null,null,null,null,null,null,null,0,20,0,19976.249999999996]
[null,"SAN LUIS POTOSI","MUZF701029F18","MUZF701029HSPXPD07","MUÑOZ ZAPATA FEDERICO","24DPT0003S",null,null,null,null,null,null,null,null,null,null,null,null,null,null,null,0,20,0,11605.352159999999]
[null,"SAN LUIS POTOSI","VARN6802263L9","VARN680226HSPZMS07","VAZQUEZ RAMIREZ NASARIO","24DPT0007O",null,null,null,null,null,null,null,null,null,null,null,null,null,null,null,0,18,0,16852.269999999997]
[null,"SAN LUIS POTOSI","IACN720128FT9","IACN720128MTSZRL07","NELLY ROSINA IZAGUIRRE CARDENAS","24DPT0001U",null,null,null,null,null,null,null,null,null,null,null,null,null,null,null,0,12,0,17743.949999999997]
[null,"SAN LUIS POTOSI","MAMN741116431","MAMN741116MSPRNL00","NELY MARTINEZ MENDEZ","24DPT0005Q",null,null,null,null,null,null,null,null,null,null,null,null,null,null,null,0,20,0,23100.82]
[null,"SAN LUIS POTOSI","VELN790226NK7","VELN790226HSPGPS08","NESTOR DAVID VEGA LOPEZ","24DPT0009M",null,null,null,null,null,null,null,null,null,null,null,null,null,null,null,0,20,0,8203.2462000000014]
[null,"SAN LUIS POTOSI","ZAEN580910A82","ZAEN580910HSPMLC05","NICOLAS FLORENTINO ZAMORA ELENA","24DPT0001U",null,null,null,null,null,null,null,null,null,null,null,null,null,null,null,0,20,0,12640.539999999999]
[null,"SAN LUIS POTOSI","REON6505273IA","REON650527MSPSLM06","NOEMI RESENDIZ OLVERA","24DPT0001U",null,null,null,null,null,null,null,null,null,null,null,null,null,null,null,0,8,0,5864.14]
[null,"SAN LUIS POTOSI","GAWE720429","GAWE720429MSPRLV00","NOHEMI GONZALEZ CASTILLO","24DPT0001U",null,null,null,null,null,null,null,null,null,null,null,null,null,null,null,0,10,0,2737.6]
[null,"SAN LUIS POTOSI","HEZN6209238G4","HEZN620923MTSRVR07","NORA ELVA HERNANDEZ  ZAVALA","24DPT0001U",null,null,null,null,null,null,null,null,null,null,null,null,null,null,null,0,20,0,21433.14]
[null,"SAN LUIS POTOSI","MORN691121QC4","MORN691121MSPCMR06","NORMA MOCTEZUMA RAMIREZ","24DPT0001U",null,null,null,null,null,null,null,null,null,null,null,null,null,null,null,0,20,0,17772.96]
[null,"SAN LUIS POTOSI","GUMO6906207Z5","GUMO690620MNLRRL03","OLGA  GUERRERO  MORENO","24DPT0005Q",null,null,null,null,null,null,null,null,null,null,null,null,null,null,null,0,20,0,18361.66]
[null,"SAN LUIS POTOSI","RUSO760607LB8","RUSO760607MSPVGL03","OLGA ELENA RUVALCABA SEGURA","24DPT0009M",null,null,null,null,null,null,null,null,null,null,null,null,null,null,null,0,20,0,13986.020000000002]
[null,"SAN LUIS POTOSI","SITO710826RY5","SITO710826MSPLPL07","OLGA LIDIA SILVA TAPIA","24DPT0005Q",null,null,null,null,null,null,null,null,null,null,null,null,null,null,null,0,20,0,15244.387199999999]
[null,"SAN LUIS POTOSI","ROGO7506208V4","ROGO750620MJCDRL18","OLGA MIRIAM RODRIGUEZ GARCIA","24DPT0009M",null,null,null,null,null,null,null,null,null,null,null,null,null,null,null,0,20,0,10421.656399999991]
[null,"SAN LUIS POTOSI","ZAMO781007TN8","ZAMO781007HTSVRS09","OSCAR IGNACIO ZAVALA MARTINEZ","24DPT0005Q",null,null,null,null,null,null,null,null,null,null,null,null,null,null,null,0,20,0,20449.059999999998]
[null,"SAN LUIS POTOSI","GUDO5512047FO","GUDO551204MTSRZT03","GUERRA DIAZ OTILIA ELIZABETH","24DPT0007O",null,null,null,null,null,null,null,null,null,null,null,null,null,null,null,0,20,0,25233.559999999998]
[null,"SAN LUIS POTOSI","COJP580618DF1","COJP580618HSPRRB03","PABLO CORPUS JUAREZ","24DPT0005Q",null,null,null,null,null,null,null,null,null,null,null,null,null,null,null,0,20,0,23398.05]
[null,"SAN LUIS POTOSI","RAMP610701DI8","RAMP610701HMCMRB04","PABLO RAMIREZ MARTINEZ","24DPT0001U",null,null,null,null,null,null,null,null,null,null,null,null,null,null,null,0,20,0,10808.989999999998]
[null,"SAN LUIS POTOSI","MADP601115KJ2","MADP601115HSPRVB08","PABLO ALBERTO MARTINEZ  DAVILA","24DPT0005Q",null,null,null,null,null,null,null,null,null,null,null,null,null,null,null,0,20,0,25538.619999999988]
[null,"SAN LUIS POTOSI","MUGP870205AV5","MUGP870205MSPXMM02","MUÑIZ GOMEZ PAMELA","24DPT0007O",null,null,null,null,null,null,null,null,null,null,null,null,null,null,null,0,19,0,15483.769999999999]
[null,"SAN LUIS POTOSI","PARA7506234J1","PARA750623MSPRDL08","PARRA RUEDA ALMA ALICIA","24DPT0003S",null,null,null,null,null,null,null,null,null,null,null,null,null,null,null,0,9,0,12210.6]
[null,"SAN LUIS POTOSI","SAPP700212N85","SAPP700212HSPMND08","PEDRO SAMANO PONCE","24DPT0001U",null,null,null,null,null,null,null,null,null,null,null,null,null,null,null,0,20,0,14826.220000000001]
[null,"SAN LUIS POTOSI","ZUVP7411101R4","ZUVP741110HSPXND04","ZUÑIGA VENTURA PEDRO","24DPT0007O",null,null,null,null,null,null,null,null,null,null,null,null,null,null,null,0,20,0,18454.32]
[null,"SAN LUIS POTOSI","NASP620425RH3","NASP620425HSPVSD03","NAVARRETE SOSA PEDRO ANTONIO","24DPT0007O",null,null,null,null,null,null,null,null,null,null,null,null,null,null,null,0,16,0,7468.989999999998]
[null,"SAN LUIS POTOSI","PECR760307GI7","PECR760307MSPXRS06","PEÑA CAREAGA ROSALBA","24DPT0003S",null,null,null,null,null,null,null,null,null,null,null,null,null,null,null,0,6,0,9132.9999999999982]
[null,"SAN LUIS POTOSI","PEEP890119HSP","PEEP890119HSPXSB05","PEÑA ESTRADA PABLO MIGUEL","24DPT0003S",null,null,null,null,null,null,null,null,null,null,null,null,null,null,null,0,10,0,2355.98]
[null,"SAN LUIS POTOSI","CAAP651030TB8","CAAP651030MSPSVT05","PETRA CASTILLO  AVILA","24DPT0001U",null,null,null,null,null,null,null,null,null,null,null,null,null,null,null,0,20,0,8537.4700000000012]
[null,"SAN LUIS POTOSI","LOCR5807107Q5","LOCR580710HSPPSF08","LOPEZ CASTILLO RAFAEL","24DPT0007O",null,null,null,null,null,null,null,null,null,null,null,null,null,null,null,0,20,0,21869.98]
[null,"SAN LUIS POTOSI","RURR611024A24","RURR611024HSPZNF04","RAFAEL RUIZ RANGEL","24DPT0009M",null,null,null,null,null,null,null,null,null,null,null,null,null,null,null,0,20,0,13214.759999999998]
[null,"SAN LUIS POTOSI","SADR780305K50","SADR780305HSPLSF09","RAFAEL SALADO  DIOSDADO","24DPT0009M",null,null,null,null,null,null,null,null,null,null,null,null,null,null,null,0,20,0,13160.769999999999]
[null,"SAN LUIS POTOSI","TOZR761021T4A","TOZR761021HSPBCF09","TOBIAS ZACARIAS RAFAEL","24DPT0007O",null,null,null,null,null,null,null,null,null,null,null,null,null,null,null,0,20,0,23328.949999999997]
[null,"SAN LUIS POTOSI","MOPR760718F85","MOPR760718HSPNDF01","RAFAEL   MONTANTE PADRON","24DPT0009M",null,null,null,null,null,null,null,null,null,null,null,null,null,null,null,0,20,0,5582.0471200000102]
[null,"SAN LUIS POTOSI","CORR640814PJ5","CORR640814HSPLDF04","RAFAEL MARTIN COLUNGA RODRIGUEZ","24DPT0009M",null,null,null,null,null,null,null,null,null,null,null,null,null,null,null,0,20,0,2845.486894000001]
[null,"SAN LUIS POTOSI","RALI650814RIA","RALI650814HSPNRS08","RANGEL LOERA ISMAEL","24DPT0003S",null,null,null,null,null,null,null,null,null,null,null,null,null,null,null,0,20,0,19344.559999999998]
[null,"SAN LUIS POTOSI","MALR751018G42","MALR751018MPLRPQ02","MARTINEZ LOPEZ RAQUEL","24DPT0007O",null,null,null,null,null,null,null,null,null,null,null,null,null,null,null,0,19,0,8099.329999999999]
[null,"SAN LUIS POTOSI","VERR770815LE8","VEER770815HSPRVY08","VERA REVELES RAYMUNDO JESUS","24DPT0007O",null,null,null,null,null,null,null,null,null,null,null,null,null,null,null,0,20,0,-1530.0900000000001]
[null,"SAN LUIS POTOSI","REAI771031CL0","REAI771031HSPYRS09","REYES ARZOLA ISAAC","24DPT0003S",null,null,null,null,null,null,null,null,null,null,null,null,null,null,null,0,20,0,22020.12]
[null,"SAN LUIS POTOSI","REMY780416J54","REMY780416MCLYNM02","REYES MENDOZA MARIA YAMINA","24DPT0003S",null,null,null,null,null,null,null,null,null,null,null,null,null,null,null,0,20,0,17413.22048]
[null,"SAN LUIS POTOSI","RECJ630208ND7","RECJ630208HSPYRV06","REYNA CARDENAS JUVENCIO","24DPT0003S",null,null,null,null,null,null,null,null,null,null,null,null,null,null,null,0,20,0,20080.049999999988]
[null,"SAN LUIS POTOSI","COMR481210UL6","COMR481210MSPVNY01","REYNA COVARRUBIAS MENDOZA","24DPT0001U",null,null,null,null,null,null,null,null,null,null,null,null,null,null,null,0,20,0,17002.21]
[null,"SAN LUIS POTOSI","HILR550718H26","HILR550718HSPDPY09","REYNALDO HIDALGO LOPEZ","24DPT0005Q",null,null,null,null,null,null,null,null,null,null,null,null,null,null,null,0,20,0,25570.289999999994]
[null,"SAN LUIS POTOSI","GOFR541109T40","GOFR541109HGTMLC03","RICARDO GOMEZ FLORES","24DPT0009M",null,null,null,null,null,null,null,null,null,null,null,null,null,null,null,0,20,0,6559.7190999999993]
[null,"SAN LUIS POTOSI","VIRR820407UD6","VIRR820407HSPLDC07","VILLANUEVA RODRIGUEZ RICARDO AUGUSTO","24DPT0007O",null,null,null,null,null,null,null,null,null,null,null,null,null,null,null,0,20,0,11464.92]
[null,"SAN LUIS POTOSI","COCR820311651","COCR820311HSPRNC04","CORTEZ CONTRERAS RICARDO ROLANDO","24DPT0007O",null,null,null,null,null,null,null,null,null,null,null,null,null,null,null,0,20,0,18786.777999999998]
[null,"SAN LUIS POTOSI","DETR550304SL3","DETR550304HSPBPB07","ROBERTO DEBO  TAPIA","24DPT0005Q",null,null,null,null,null,null,null,null,null,null,null,null,null,null,null,0,20,0,24988.28]
[null,"SAN LUIS POTOSI","GALR720507BR2","GALR720507HSPLPB07","ROBERTO GALARZA LOPEZ","24DPT0005Q",null,null,null,null,null,null,null,null,null,null,null,null,null,null,null,0,20,0,17030.219999999998]
[null,"SAN LUIS POTOSI","HEHR531031IA9","HEHR531031HTSRRB09","ROBERTO HERNANDEZ HERNANDEZ","24DPT0005Q",null,null,null,null,null,null,null,null,null,null,null,null,null,null,null,0,16,0,12813.52]
[null,"SAN LUIS POTOSI","OIOR520826S36","OIOR520826HSPNLB09","ROBERTO ONTIVEROS  OLVERA","24DPT0005Q",null,null,null,null,null,null,null,null,null,null,null,null,null,null,null,0,20,0,22572.18]
[null,"SAN LUIS POTOSI","SIVR460513GK8","SIVR460513HSPLRB09","ROBERTO SILVA VARGAS","24DPT0009M",null,null,null,null,null,null,null,null,null,null,null,null,null,null,null,0,20,0,10098.73]
[null,"SAN LUIS POTOSI","RONR760726R81","RONR760726HSPDRB01","ROBERTO   RODRIGUEZ NARVAEZ","24DPT0009M",null,null,null,null,null,null,null,null,null,null,null,null,null,null,null,0,20,0,15635.82]
[null,"SAN LUIS POTOSI","GARR550513GQ5","GARR550513HSPRDB07","ROBERTO PORFIRIO GARCIA RODRIGUEZ","24DPT0009M",null,null,null,null,null,null,null,null,null,null,null,null,null,null,null,0,20,0,13242.06]
[null,"SAN LUIS POTOSI","ROGH6205024I0","ROGH620502HSPCTC06","ROCHA GAITAN HECTOR","24DPT0003S",null,null,null,null,null,null,null,null,null,null,null,null,null,null,null,0,20,0,23131.520000000011]
[null,"SAN LUIS POTOSI","VAMR7708202Y9","VAMR770820MSPLRC07","ROCIO YUNUEN VALDIVIA MARQUEZ","24DPT0009M",null,null,null,null,null,null,null,null,null,null,null,null,null,null,null,0,20,0,13434.9]
[null,"SAN LUIS POTOSI","ROAR640809MVA","ROAR640809MSPDLM06","RODRIGUEZ ALVARADO ROMANA","24DPT0003S",null,null,null,null,null,null,null,null,null,null,null,null,null,null,null,0,20,0,24419.950000000008]
[null,"SAN LUIS POTOSI","ROAT681015HRO","ROAT681015MSPDLR08","RODRIGUEZ ALVISO TERESA DE JESUS","24DPT0003S",null,null,null,null,null,null,null,null,null,null,null,null,null,null,null,0,20,0,25186.020000000011]
[null,"SAN LUIS POTOSI","ROBA710121429","ROBA710121MSPDRL09","RODRIGUEZ BARRON ALMA ROSA","24DPT0003S",null,null,null,null,null,null,null,null,null,null,null,null,null,null,null,0,20,0,25011.490000000009]
[null,"SAN LUIS POTOSI","ROCE701105KU1","ROCE701105MSPDRL08","RODRIGUEZ CERDA ELSA","24DPT0003S",null,null,null,null,null,null,null,null,null,null,null,null,null,null,null,0,20,0,25695.639999999996]
[null,"SAN LUIS POTOSI","ROGG670204618","ROGG670204HSPDRL07","RODRIGUEZ GARCIA GILBERTO","24DPT0003S",null,null,null,null,null,null,null,null,null,null,null,null,null,null,null,0,20,0,22027.190000000021]
[null,"SAN LUIS POTOSI","MACR460808JL8","MACR460808HDFRRG01","ROGELIO MARTINEZ CARDENAS","24DPT0009M",null,null,null,null,null,null,null,null,null,null,null,null,null,null,null,0,20,0,16933.55]
[null,"SAN LUIS POTOSI","MURR701108HU7","MURR701108HSPXLG05","ROGELIO MUÑOZ RAMIREZ","24DPT0001U",null,null,null,null,null,null,null,null,null,null,null,null,null,null,null,0,20,0,2871.579999999999]
[null,"SAN LUIS POTOSI","PEGR600809AM3","PEGR600809HSPRRM02","ROMAN PEREZ GARCIA","24DPT0009M",null,null,null,null,null,null,null,null,null,null,null,null,null,null,null,0,20,0,15400.500000000002]
[null,"SAN LUIS POTOSI","VIMR530429552","VIMR530429MCLLDS02","ROSA ALICIA VILLEGAS  MEDELLIN","24DPT0009M",null,null,null,null,null,null,null,null,null,null,null,null,null,null,null,0,20,0,15981.980000000001]
[null,"SAN LUIS POTOSI","MOPR6303238X2","MOPR630323MSPRRS06","ROSA AURELIA MORAN PERALES","24DPT0009M",null,null,null,null,null,null,null,null,null,null,null,null,null,null,null,0,20,0,16367.48]
[null,"SAN LUIS POTOSI","AUZR620708VP7","AUZR620708MSPZXS00","24DPT0009M  ","24DPT0009M",null,null,null,null,null,null,null,null,null,null,null,null,null,null,null,0,20,0,17158.029999999992]
[null,"SAN LUIS POTOSI","GUMR700301CP","GUMR700301MSPRNS09","ROSA MARIA GUERRERO MENDOZA","24DPT0001U",null,null,null,null,null,null,null,null,null,null,null,null,null,null,null,0,20,0,24067.27]
[null,"SAN LUIS POTOSI","ZAER65101664A","ZAER651016MSPPSS05","ROSALVA ZAPATA ESQUIVEL","24DPT0005Q",null,null,null,null,null,null,null,null,null,null,null,null,null,null,null,0,15,0,15772.23977]
[null,"SAN LUIS POTOSI","VEPR840111TK9","VEPR840111MSOLNX02","ROXANA VELAZQUEZ PUENTE","24DPT0009M",null,null,null,null,null,null,null,null,null,null,null,null,null,null,null,0,20,0,13813.95]
[null,"SAN LUIS POTOSI","CAPR6201295A2","CAPR620129HSPMDB06","RUBEN CAMACHO PADRON","24DPT0001U",null,null,null,null,null,null,null,null,null,null,null,null,null,null,null,0,20,0,12261.1]
[null,"SAN LUIS POTOSI","ROHR550913UA8","ROHR550913HSPCRB08","RUBEN ROCHA HERNANDEZ","24DPT0005Q",null,null,null,null,null,null,null,null,null,null,null,null,null,null,null,0,20,0,23956.909999999996]
[null,"SAN LUIS POTOSI","RUCH5602237U6","RUCH560223HSPDRC07","RUEDA CARMONA HECTOR MANUEL","24DPT0003S",null,null,null,null,null,null,null,null,null,null,null,null,null,null,null,0,20,0,18699.829999999991]
[null,"SAN LUIS POTOSI","SAEC841019T26","SAEC841019MTLLSL01","SALAZAR ESPINOSA CLAUDIA NATIVIDAD","24DPT0003S",null,null,null,null,null,null,null,null,null,null,null,null,null,null,null,0,18,0,11342.8]
[null,"SAN LUIS POTOSI","LEMS430127168","LEMS430127HJCDRL07","SALVADOR LEDESMA MARTINEZ","24DPT0009M",null,null,null,null,null,null,null,null,null,null,null,null,null,null,null,0,20,0,17117.299999999988]
[null,"SAN LUIS POTOSI","SARM630502EA7","SARM630502HSPNNR08","SANDOVAL RANGEL MARTIN","24DPT0003S",null,null,null,null,null,null,null,null,null,null,null,null,null,null,null,0,20,0,20499.169999999998]
[null,"SAN LUIS POTOSI","MAMS830804ME7","MAMS830804MSPRRN06","SANDRA CECILIA MARTINEZ MARTINEZ","24DPT0001U",null,null,null,null,null,null,null,null,null,null,null,null,null,null,null,0,17,0,9287.0600000000013]
[null,"SAN LUIS POTOSI","TOMS6209162B5","TOMS620916MSPRCN03","SANDRA LUZ TORRES MOCTEZUMA","24DPT0001U",null,null,null,null,null,null,null,null,null,null,null,null,null,null,null,0,20,0,19247.980000000003]
[null,"SAN LUIS POTOSI","CEAS560904313","CEAS560904HCMRVN09","CERNAS AVALOS SANTIAGO","24DPT0007O",null,null,null,null,null,null,null,null,null,null,null,null,null,null,null,0,20,0,22504.670000000002]
[null,"SAN LUIS POTOSI","EAMS530908K58","EAMS530908HSPSNR05","SERGIO ESCALANTE MONREAL","24DPT0005Q",null,null,null,null,null,null,null,null,null,null,null,null,null,null,null,0,20,0,24987.38]
[null,"SAN LUIS POTOSI","HEGS811219AY5","HEGS811219HSPRRR04","SERGIO EDUARDO HERNANDEZ GARCIA","24DPT0009M",null,null,null,null,null,null,null,null,null,null,null,null,null,null,null,0,20,0,5557.4000000000005]
[null,"SAN LUIS POTOSI","MARS590126IL8","MARS590126MSPROL09","MARTINEZ RODRIGUEZ SILVIA","24DPT0007O",null,null,null,null,null,null,null,null,null,null,null,null,null,null,null,0,20,0,19732.13]
[null,"SAN LUIS POTOSI","BAMS641103QN1","BAMS641103MSPRNL09","SILVIA ELENA BARRIOS MENDOZA","24DPT0001U",null,null,null,null,null,null,null,null,null,null,null,null,null,null,null,0,20,0,23519.73]
[null,"SAN LUIS POTOSI","OEDS690601H87","OEDS690601MSPRZL01","SILVIA GUADALUPE ORTEGA DIAZ","24DPT0009M",null,null,null,null,null,null,null,null,null,null,null,null,null,null,null,0,20,0,9397.880000000001]
[null,"SAN LUIS POTOSI","MEBS710610EM4","MEBS710610MSPNRL03","SILVIA MANUELA MENDEZ BRISEÑO","24DPT0005Q",null,null,null,null,null,null,null,null,null,null,null,null,null,null,null,0,12,0,13340.899999999998]
[null,"SAN LUIS POTOSI","EAPS800918S72","EAPS800918MSPSRS05","SUSANA ELIZABETH ESCALANTE PEREZ","24DPT0009M",null,null,null,null,null,null,null,null,null,null,null,null,null,null,null,0,20,0,-3401.46]
[null,"SAN LUIS POTOSI","MAGT910115E60","MAGT910115MSPRRH05","THANYA LIZZETH MARTINEZ GUERRERO","24DPT0001U",null,null,null,null,null,null,null,null,null,null,null,null,null,null,null,0,18,0,11800.529999999999]
[null,"SAN LUIS POTOSI","SOAT6101048K8","SOAT610104HVZSNM18","TOMAS SOSA DEL ANGEL","24DPT0005Q",null,null,null,null,null,null,null,null,null,null,null,null,null,null,null,0,20,0,5399.4699999999993]
[null,"SAN LUIS POTOSI","TOEX860325JN8","TOEX860325MSPRSC06","TORRES ESTRADA XOCHITL ARMANDINA","24DPT0003S",null,null,null,null,null,null,null,null,null,null,null,null,null,null,null,0,15,0,4183.05]
[null,"SAN LUIS POTOSI","TOFR8004283Q6","TOFR800428MSPRCB01","TORRES FACUNDO MARIA REBECA","24DPT0003S",null,null,null,null,null,null,null,null,null,null,null,null,null,null,null,0,20,0,9371.9455080000007]
[null,"SAN LUIS POTOSI","TONS750716RT0","TONS750716MCLRVL01","TORRES NAVA SILVIA ELIZABETH","24DPT0003S",null,null,null,null,null,null,null,null,null,null,null,null,null,null,null,0,20,0,18289.662879999996]
[null,"SAN LUIS POTOSI","GOGV400220AE2","GOGV400220HSPNNC13","VICTOR GONZALEZ GONZALEZ","24DPT0009M",null,null,null,null,null,null,null,null,null,null,null,null,null,null,null,0,20,0,14991.380000000001]
[null,"SAN LUIS POTOSI","HUHV741223MX5","HUHV741223HSPRRC01","VICTOR MANUEL HURTADO HERNANDEZ","24DPT0005Q",null,null,null,null,null,null,null,null,null,null,null,null,null,null,null,0,20,0,16279.359999999999]
[null,"SAN LUIS POTOSI","IAAV7612233Z6","IAAV761223HSPZRC06","VICTOR MANUEL IZAGUIRRE ARELLANO","24DPT0001U",null,null,null,null,null,null,null,null,null,null,null,null,null,null,null,0,20,0,21228.550000000003]
[null,"SAN LUIS POTOSI","SIMV7104087G7","SIMV710408HSPRNC00","VICTOR MANUEL SIERRA MONTOYA","24DPT0009M",null,null,null,null,null,null,null,null,null,null,null,null,null,null,null,0,20,0,10658.408799999997]
[null,"SAN LUIS POTOSI","CAFV721223IG8","CAFV721223MSPMLC04","VICTORIA CAMPOS FLORES","24DPT0005Q",null,null,null,null,null,null,null,null,null,null,null,null,null,null,null,0,20,0,24935.119999999988]
[null,"SAN LUIS POTOSI","VILC750206FG0","VILC750206MSPLLR05","VILLANUEVA LLANAS MARIA DEL CARMEN","24DPT0003S",null,null,null,null,null,null,null,null,null,null,null,null,null,null,null,0,20,0,17657.71]
[null,"SAN LUIS POTOSI","RIHV8302182D","RIGV830218MSPSNR03","VIRGINIA RIOS GONZALEZ","24DPT0005Q",null,null,null,null,null,null,null,null,null,null,null,null,null,null,null,0,20,0,21514.84]
[null,"SAN LUIS POTOSI","AURW7711233I3","AURW771123MSPGYN07","AGUILAR REYES WENDY GUADALUPE","24DPT0007O",null,null,null,null,null,null,null,null,null,null,null,null,null,null,null,0,20,0,20252.189999999999]
[null,"SAN LUIS POTOSI","MAAY830329C07","MAAY830329MSPRLN06","YENDI NAYELI MARTINEZ ALVARADO","24DPT0009M",null,null,null,null,null,null,null,null,null,null,null,null,null,null,null,0,20,0,14409.88]
[null,"SAN LUIS POTOSI","BAXY600213Q39","BAXY600213MSPRXL06","YOLANDA BARRIOS N/A","24DPT0001U",null,null,null,null,null,null,null,null,null,null,null,null,null,null,null,0,20,0,21338.92]
[null,"SAN LUIS POTOSI","PEDY750108K77","PEDY750108MSPRZL03","YOLANDA GRICELDA PEREZ DIAZ","24DPT0009M",null,null,null,null,null,null,null,null,null,null,null,null,null,null,null,0,20,0,15324.519999999999]
[null,"SAN LUIS POTOSI","ZARE810108KA9","ZARE810108MSPMDL06","ZAMORA RODRIGUEZ ELISA ","24DPT0003S",null,null,null,null,null,null,null,null,null,null,null,null,null,null,null,0,12,0,6488.23]
[]
[]
[]
[]
[null,"Total Personas : ",530,null,null,null,null,null,null,null,null,null,null,null,null,null,null,null,null,null,null,"Total Recursos Ejercidos:",null,null,{"$f":"SUBTOTAL(109,Tabla11[Total de recursos presupuestales ejercidos en servicios personales en el periodo\n(2)])","v":14475025.721298024}]
[]
[null,"Fuente : Información proporcionada por las Entidades Federativas."]

{"sheet":"II C y 1_","index":5,"n_rows":194,"n_cols":22,"rows_kept":194,"cut":false,"hidden":false,"merged":[[190,1,191,17],[11,21,12,21],[11,8,12,8],[11,9,11,15],[11,16,12,16],[11,17,12,17],[8,1,8,8],[11,1,12,1],[11,2,12,2],[11,5,12,5],[11,20,12,20],[187,18,187,19],[11,6,12,6],[11,7,12,7],[11,18,11,19],[11,3,12,3],[11,4,12,4]]}
[]
[]
[]
[]
[]
[]
[]
[null,"Formato: Personal Federalizado por Registro Federal de Contribuyentes"]
[null,{"$f":"IF('Caratula Resumen'!D22=\"Elige el Periodo…\",\"\",'Caratula Resumen'!D22)","v":"Fondo de Aportaciones para la Educación Tecnológica y de Adultos/Colegio Nacional de Educación Profesional Técnica (FAETA/CONALEP)"},null,null,null,null,null,null,null,null,null,null,null,null,null,null,null,null,null,null,{"$f":"IF('Caratula Resumen'!D23=\"Elige el Periodo…\",\"\",'Caratula Resumen'!D23)","v":"3er. Trimestre"}]
[]
[]
[null,"Entidad Federativa","Clave CT","Turno","RFC","CURP","Nombre","Funcion Real","Horas que labora en el Centro de Trabajo","Clave Presupuestal",null,null,null,null,null,null,"Tipo de Categoría","Identificador de Contrato de Honorarios","Periodo de efecto de pago en el trimestre",null,"Percepciones pagadas en el Periodo de Comisión con Presupuesto Federal*","Percepciones pagadas en el Periodo de Comisión con Presupuesto de otra fuente*"]
[null,null,null,null,null,null,null,null,null,"Partida Presupuestal","Código de Pago","Clave de Unidad","Clave de Sub Unidad","Clave de Categoría","Horas Semana Mes ","Número de Plaza",null,null,"Inicial","Termino"]
[]
[null,"Entidad Federativa","Clave CT","Turno","RFC","CURP","Nombre","Funcion Real","Horas que labora en el Centro de Trabajo","Partida Presupuestal","Código de Pago","Clave de Unidad","Clave de Sub Unidad","Clave de Categoría","Horas semana mes","Número de plaza","Tipo de Categoría","Identificador de Contrato de Honorarios","Periodo de efecto de pago en el trimestre\nInicial","Periodo de efecto de pago en el trimestre\nTermino","Percepciones pagadas en el Periodo de Comisión con Presupuesto Federal*","Percepciones pagadas en el Periodo de Comisión con Presupuesto de otra fuente*"]
[null,"SAN LUIS POTOSI","24DPT0005Q","100","GACA8606041K6","GACA860604HSPRSD08","ADRIAN GARCIA CASTILLO","2314",40,"01131","1003","53","2","S01201","00.0","3281","2",null,"20130915","20130930",2969.9745000000003,0]
[null,"SAN LUIS POTOSI","24DPT0009M","100","TUBA630811ME9","TUBA630811HSPDLL18","ALAYN TUDON BALDAZO","2314",40,"01131","1003","53","2","S01201","00.0",9234,"2",null,"20130731","20130930",14997.85,0]
[null,"SAN LUIS POTOSI","24DPT0001U","100","DIRA831017RWA","DIRA831017HSPZML00","ALEJANDRO DIAZ RAMIREZ","2314",40,"01131","1003","53","2","S01201","00.0",3296,"2",null,"20130715","20130930",24295.473400000003,0]
[null,"SAN LUIS POTOSI","24DPT0009M","100","MOAL660825G18","MOXA660825HSPRXL06","ALFREDO MORENO .","2314",40,"01131","1003","53","2","S01202","00.0",9262,"2",null,"20130715","20130930",37854.478500000005,0]
[null,"SAN LUIS POTOSI","24DPT0009M","100","DIFA410704P57","DIFA410704MTSZLL01","ALICIA DIAZ FLORES","2314",40,"01131","1003","53","2","A03202","00.0","9234","2",null,"20130715","20130715",5529.3534,0]
[null,"SAN LUIS POTOSI","24DPT0005Q","100","AOAB710714253","AOAB710714MDFLRN03","ALONSO ARROYO BUENAVENTURA","548",40,"01131","1003","53","2","CF02105","00.0",14657,"5",null,"20130715","20130930",66459.896999999997,0]
[null,"SAN LUIS POTOSI","24DPT0009M","100","LARA6807312Z9","LARA680731MSPLDN09","ANA MARIA LLAMAS RODRIGUEZ","2314",40,"01131","1003","53","2","S01202","00.0",9253,"2",null,"20130715","20130930",34756.1348,0]
[null,"SAN LUIS POTOSI","24DPT0003S","100","MAGA3904151C1","MAGA390415HSPRRN04","ANASTACIO MARTINEZ GARCIA","2314",40,"01131","1003","53","2","S01202","00.0",5112,"2",null,"20130715","20130930",39667.128600000004,0]
[null,"SAN LUIS POTOSI","24DPT0009M","100","CAGX670227BG6","CXGA670227HSPSLR02","ARIEL SAN MARTIN CASTELLANOS GUILLEN","548",40,"01131","1003","53","2","D004","00.0",12706,"5",null,"20130715","20130930",85992.471000000005,0]
[null,"SAN LUIS POTOSI","24DPT0001U","100","MOGB710304G33","MOGB710304HSPRLN00","BENJAMIN OMAR MORALES GUILLEN","2314",40,"01131","1003","53","2","CF34202","00.0",12054,"2",null,"20130715","20130930",19872.200800000002,0]
[null,"SAN LUIS POTOSI","24DPT0001U","100","RIPC880609KX9","RIPC880609MSPVLN03","CANDIDA NALLELY RIVERA PALACIOS","2314",40,"01131","1003","53","2","S01202","00.0",3322,"2",null,"20130715","20130930",25622.551200000002,0]
[null,"SAN LUIS POTOSI","24DPT0001U","100","ROVC771023CW0","ROVC771023HSPMDR00","CARLOS ALBERTO ROMO VIDALES","2314",40,"01131","1003","53","2","A03202","00.0",3301,"2",null,"20130715","20130930",31868.222800000003,0]
[null,"SAN LUIS POTOSI","24DPT0009M","100","ROHC591104GNA","ROHC591104HTSDRR02","CARLOS RODRIGUEZ HERNANDEZ","2314",40,"01131","1003","53","2","CF33206","00.0",14041,"2",null,"20130715","20130930",110294.4418,0]
[null,"SAN LUIS POTOSI","24DPT0001U","100","TOSC640102T47","TOSC640102MSPRLR03","CARMEN JULIA TORRES SOLIS","2314",40,"01131","1003","53","2","CF33206","00.0",13856,"2",null,"20130715","20130930",98028.563099999999,0]
[null,"SAN LUIS POTOSI","24DPT0009X","100","SAPC761004QI1","SAPC761004MSPNRR02","CARMEN LISETTE SANCHEZ PEREZ","2314",40,"01131","1003","53","2","CF33206","00.0",13800,"2",null,"20130715","20130930",92947.143200000006,0]
[null,"SAN LUIS POTOSI","24DPT0009X","100","RAGC760321QD4","RAGC760321MSPMTL04","CLAUDIA IVONNE RAMOS GUTIERREZ","548",40,"01131","1003","53","2","CF02100","00.0",12507,"5",null,"20130715","20130930",75764.277000000002,0]
[null,"SAN LUIS POTOSI","24DPT0001U","100","GOLC801206QJ7","GOLC801206MSPNNL06","CLAUDIA MORENA GONZALEZ DE LEON","2314",40,"01131","1003","53","2","A03202","00.0",3297,"2",null,"20130715","20130930",33718.705999999998,0]
[null,"SAN LUIS POTOSI","24DPT0005Q","100","BEOC791213PUG","BEOC791213HMCLRR05","CRHISTIAN ARTURO BELTRAN ORTEGA","2314",40,"01131","1003","53","2","A01801","00.0",32002,"2",null,"20130715","20130930",40204.747300000003,0]
[null,"SAN LUIS POTOSI","24DPT0009X","100","SASC740427A77","SASC740427MSPNSY06","CYNTHIA ANGELICA SANCHEZ SESMA","2314",40,"01131","1003","53","2","CF33206","00.0",13855,"2",null,"20130715","20130930",97433.496299999999,0]
[null,"SAN LUIS POTOSI","24DPT0003S","100","MACE730306K53","MACE730306MSPNDL03","ELDA GUADALUPE MANZANARES CEDILLO","2314",40,"01131","1003","53","2","CF33206","00.0",13945,"2",null,"20130715","20130930",97186.616300000009,0]
[null,"SAN LUIS POTOSI","24DPT0009X","100","LOHE7609184N6","LOHE760918MGTNRL00","ELSA LONGORIA HERNANDEZ","2314",40,"01131","1003","53","2","CF33206","00.0",11187,"2",null,"20130715","20130930",92285.276299999998,0]
[null,"SAN LUIS POTOSI","24DPT0009M","100","SARE6202234P9","SARE620223MGTNYL05","ELVA MARTHA SANCHEZ REYES","2314",40,"01131","1003","53","2","CF19201","00.0",9237,"2",null,"20130715","20130930",37964.621299999999,0]
[null,"SAN LUIS POTOSI","24DPT0009X","100","CASE760707JF9","CASE760707MSPLFL01","ELVIA ESTHER CALDERON SAFA","2314",40,"01131","1003","53","2","CF33206","00.0",11178,"2",null,"20130715","20130930",93929.022600000011,0]
[null,"SAN LUIS POTOSI","24DPT0001U","100","HUGE570105RR1","HUGE570105HSPRNM01","EMILIANO HUERTA GONZALEZ","2314",40,"01131","1003","53","2","S01202","00.0",3304,"2",null,"20130715","20130930",35624.903299999998,0]
[null,"SAN LUIS POTOSI","24DPT0009M","100","GOME590117GA8","GOME590117HTSVCN07","ENRIQUE RAFAEL GOVEA MOCTEZUMA","2314",40,"01131","1003","53","2","CF33206","00.0",14528,"2",null,"20130715","20130930",108359.4384,0]
[null,"SAN LUIS POTOSI","24DPT0001U","100","CAPE7205048Y3","CAPE720504HSPHZR05","ERNESTO CHAVEZ POZOS","2314",40,"01131","1003","53","2","CF19201","00.0",3308,"2",null,"20130715","20130930",36454.891100000001,0]
[null,"SAN LUIS POTOSI","24DPT0007O","100","FIRE770703T35","FIRE770703HASGMR01","ERNESTO FIGUEROA ROMERO","548",40,"01131","1003","53","2","CF02105","00.0",14656,"5",null,"20130715","20130930",66459.896999999997,0]
[null,"SAN LUIS POTOSI","24DPT0001U","100","HUEE8802101U6","HUEE880210MSPRSS07","ESMERALDA HUERTA ESPINO","2314",40,"01131","1003","53","2","CF34202","00.0","12054","2",null,"20130915","20130930",6613.0050000000001,0]
[null,"SAN LUIS POTOSI","24DPT0005Q","100","GOZE620303R12","GOZE620303HSPLVV07","EVERARDO GLORIA ZAVALA","2314",40,"01131","1003","53","2","CF18203","00.0",3253,"2",null,"20130715","20130930",40498.496200000001,0]
[null,"SAN LUIS POTOSI","24DPT0009M","100","NAOF731005JG9","NAOF731005MSPVRB07","FABIOLA PATRICIA NAVA ORTIZ","2314",40,"01131","1003","53","2","CF33206","00.0",14529,"2",null,"20130715","20130930",96136.632600000012,0]
[null,"SAN LUIS POTOSI","24DPT0005Q","100","COMF5002232B2","COMF500223HDFLRL06","FELIPE COLLES MURGA","2314",40,"01131","1003","53","2","CF33206","00.0",13129,"2",null,"20130715","20130930",86474.1198,0]
[null,"SAN LUIS POTOSI","24DPT0009M","100","CARF660330CX6","CARF660330HSPMVL00","FELIPE DE JESUS CAMACHO RIVERA","2314",40,"01131","1003","53","2","CF21202","00.0",9274,"2",null,"20130715","20130930",39841.362000000001,0]
[null,"SAN LUIS POTOSI","24DPT0005Q","100","CAMF701124TC7","CAMF701124HSPBDR12","FERNANDO CABRIALES MEDELLIN","2314",40,"01131","1003","53","2","CF33206","00.0",13799,"2",null,"20130715","20130930",96972.946300000011,0]
[null,"SAN LUIS POTOSI","24DPT0009M","100","GAAF571004N86","GAAF571004HSPRRR07","FRANCISCO JAVIER GARCIA AREVALO","2314",40,"01131","1003","53","2","A03202","00.0",9245,"2",null,"20130715","20130930",39200.796500000004,0]
[null,"SAN LUIS POTOSI","24DPT0009M","100","LUMF5609182L7","LUMF560918HSPNRR03","FRANCISCO LUNA MORA","2314",40,"01131","1003","53","2","S01201","00.0",11642,"2",null,"20130715","20130930",27819.0579,0]
[null,"SAN LUIS POTOSI","24DPT0007O","100","PIPF601112G12","PIPF601112HCSNLR03","FRANCISCO RENATO PINEDA PALOMEQUE","2314",40,"01131","1003","53","2","CF33206","00.0",13133,"2",null,"20130715","20130930",93215.058000000005,0]
[null,"SAN LUIS POTOSI","24DPT0007O","100","SIRF691225FK9","SIRF691225HDFLSR07","FRANCISCO SILVA ROSAS","548",40,"01131","1003","53","2","D005","00.0",12762,"5",null,"20130715","20130930",85992.417000000001,0]
[null,"SAN LUIS POTOSI","24DPT0005Q","100","PAGG590530IA4","PAGG590530HSPRRB04","GABRIEL PAREDES GUERRERO","2314",40,"01131","1003","53","2","CF34202","00.0",3278,"2",null,"20130715","20130930",35906.1446,0]
[null,"SAN LUIS POTOSI","24DPT0005Q","100","DIDG730222874","DIDG730222MTSZSB06","GABRIELA DIAZ DIOSDADO","2314",40,"01131","1003","53","2","CF33206","00.0",13130,"2",null,"20130715","20130930",95854.946300000011,0]
[null,"SAN LUIS POTOSI","24DPT0001U","100","PEHG680622FW8","PEHG680622MQTRRB00","GABRIELA PEREZ HERNANDEZ","2314",40,"01131","1003","53","2","CF19201","00.0",3307,"2",null,"20130715","20130930",37144.712899999999,0]
[null,"SAN LUIS POTOSI","24DPT0003S","100","MAIG680708QS5","MAIG680708HSPRBL07","GILBERTO MARTINEZ IBARRA","2314",40,"01131","1003","53","2","CF34201","00.0",5094,"2",null,"20130715","20130930",37881.806700000001,0]
[null,"SAN LUIS POTOSI","24DPT0003S","100","MAMH6305102W9","MAMH630510HNLNRC03","HECTOR DAVID MANZANARES MORENO","548",40,"01131","1003","53","2","D005","00.0",12730,"5",null,"20130715","20130930",85992.417000000001,0]
[null,"SAN LUIS POTOSI","24DPT0005Q","100","HEVH710718B30","HEVH710718MGTRLR03","HERLINDA HERNANDEZ VILLA","548",40,"01131","1003","53","2","D004","00.0",12549,"5",null,"20130715","20130930",85992.471000000005,0]
[null,"SAN LUIS POTOSI","24DPT0005Q","100","ROEH7612111R2","ROEH761211HTSJSG04","HUGO DANIEL ROJAS ESCAREÑO","2314",40,"01131","1003","53","2","S01201","00.0",3277,"2",null,"20130715","20130930",26831.0834,0]
[null,"SAN LUIS POTOSI","24DPT0007O","100","MAPD470328R25","MAPD470328HSPRRL01","J.DOLORES MARTINEZ PEREZ","2314",40,"01131","1003","53","2","S01201","00.0",8147,"2",null,"20130715","20130930",35160.161500000002,0]
[null,"SAN LUIS POTOSI","24DPT0007O","100","AADJ710417P70","AADJ710417HSPLZM09","JAIME ALVAREZ DIAZ","2314",40,"01131","1003","53","2","CF33204","00.0",5096,"2",null,"20130715","20130930",62345.500400000004,0]
[null,"SAN LUIS POTOSI","24DPT0009M","100","YEIJ5912243Z0","YEIJ591224HSPRBV07","JAVIER YERA IBARRA","2314",40,"01131","1003","53","2","CF33204","00.0",3292,"2",null,"20130715","20130930",59825.114100000006,0]
[null,"SAN LUIS POTOSI","24DPT0005Q","100","ROOJ620202C77","ROOJ620202MSPDRR00","JEORGINA RODRIGUEZ ORTEGA","2314",40,"01131","1003","53","2","CF21202","00.0",12114,"2",null,"20130715","20130930",36610.484799999998,0]
[null,"SAN LUIS POTOSI","24DPT0009X","100","ROCJ770306E42","ROCJ770306MSPDBS15","JESSICA ARELY RODRIGUEZ CABRERA","2314",40,"01131","1003","53","2","CF33204","00.0",3290,"2",null,"20130715","20130930",54290.624500000005,0]
[null,"SAN LUIS POTOSI","24DPT0007O","100","GUDJ5907187J8","GUDJ590718HTSRZS05","JESUS SALVADOR GUERRA DIAZ","2314",40,"01131","1003","53","2","CF19201","00.0",8146,"2",null,"20130715","20130930",41019.816700000003,0]
[null,"SAN LUIS POTOSI","24DPT0005Q","","MAGJ890820CJ8","MAGJ890820HSPTNN00","JONATHAN MATA GONZALEZ","2314",40,"01131","1003","53","2","S01201","00.0",3268,"2",null,"20130715","20130930",22835.0285,0]
[null,"SAN LUIS POTOSI","24DPT0005Q","100","CAVA5107243K4","CAVA510724HSPHRN05","JOSE A CHAVEZ VARGAS","2314",40,"01131","1003","53","2","CF33206","00.0",13128,"2",null,"20130715","20130930",117465.90890000001,0]
[null,"SAN LUIS POTOSI","24DPT0003S","100","VACE770426NC0","VACE770426HSPZRR04","JOSE ERNESTO VAZQUEZ CARRION","2314",40,"01131","1003","53","2","S01201","00.0",5085,"2",null,"20130715","20130930",24717.166700000002,0]
[null,"SAN LUIS POTOSI","24DPT0009M","100","GARF5708239A8","GARF570823HSPLML02","JOSE FELIPE GALVAN RAMIREZ","2314",40,"01131","1003","53","2","CF33204","00.0",9242,"2",null,"20130715","20130930",71869.108300000007,0]
[null,"SAN LUIS POTOSI","24DPT0005Q","100","LOEJ490328FF6","LOEJ490328HSPPSM03","JOSE JAIME LOPEZ ESCALANTE","2314",40,"01131","1003","53","2","S01202","00.0",3268,"2",null,"20130715","20130930",36799.273500000003,0]
[null,"SAN LUIS POTOSI","24DPT0001U","100","HEHL8111128I5","HEHL811112HSPRRS09","JOSE LUIS HERNANDEZ HERNANDEZ","2314",40,"01131","1003","53","2","CF04201","00.0",11924,"2",null,"20130715","20130930",36746.392500000002,0]
[null,"SAN LUIS POTOSI","24DPT0009M","100","LOEL560228TP6","LOEL560228HSPPSS08","JOSE LUIS LOPEZ ESPERICUETA","2314",40,"01131","1003","53","2","S01202","00.0",9251,"2",null,"20130715","20130930",37082.395900000003,0]
[null,"SAN LUIS POTOSI","24DPT0007O","100","IOGM6306269A8","IOGM630626HSPVMR05","JOSE MARTIN IVON GOMEZ","2314",40,"01131","1003","53","2","S01202","00.0",8149,"2",null,"20130715","20130930",27821.438000000002,0]
[null,"SAN LUIS POTOSI","24DPT0009M","100","RAAJ5411175IA","RAAJ541117HSPMMS03","JOSE RAMOS AMAYA","2314",40,"01131","1003","53","2","CF33206","00.0",9284,"2",null,"20130715","20130930",102884.1223,0]
[null,"SAN LUIS POTOSI","24DPT0005Q","100","IAGR490127IV9","IAGR490127HSPBLF04","JOSE REFUGIO IBARRA GALLEGOS","2314",40,"01131","1003","53","2","S01202","00.0",3264,"2",null,"20130715","20130930",39533.916100000002,0]
[null,"SAN LUIS POTOSI","24DPT0007O","100","GAVR610904NB5","GAVR610904HSPYLN05","JOSE RENE GAYTAN VELAZQUEZ","2314",40,"01131","1003","53","2","CF33206","00.0",9247,"2",null,"20130715","20130930",93529.407800000001,0]
[null,"SAN LUIS POTOSI","24DPT0005Q","100","SURS62121622A","SURS621216HSPSCL09","JOSE SALVADOR SUSTAITA ROCHA","2314",40,"01131","1003","53","2","A03202","00.0",8141,"2",null,"20130715","20130930",33912.350200000001,0]
[null,"SAN LUIS POTOSI","24DPT0009M","100","TOST581016ED7","TOST581016HGTRNR07","JOSE TERESO TORRES SANCHEZ","2314",40,"01131","1003","53","2","CF18203","00.0",11462,"2",null,"20130715","20130930",41736.289700000001,0]
[null,"SAN LUIS POTOSI","24DPT0001U","","ROMJ691226UG8","ROMT691226HSPDLM00","JOSE TOMAS RODRIGUEZ MALDONADO","2314",40,"01131","1003","53","2","CF34202","00.0",3276,"2",null,"20130715","20130930",19158.123500000002,0]
[null,"SAN LUIS POTOSI","24DPT0003S","100","AEMJ710318GR8","AEMJ710318MSPRRS05","JOSEFINA ARREDONDO MORENO","2314",40,"01131","1003","53","2","CF33204","00.0",5097,"2",null,"20130715","20130930",61807.097900000001,0]
[null,"SAN LUIS POTOSI","24DPT0005Q","100","LOIJ9006248S2","LOIJ900624HSPPBN08","JUAN ANTONIO LOPEZ IBARRA","2314",40,"01131","1003","53","2","S01201","00.0",3270,"2",null,"20130715","20130930",24292.98,0]
[null,"SAN LUIS POTOSI","24DPT0007O","100","BAAJ5701089W8","BAAJ570108HSPNNN02","JUAN FELIPE BANDA ANGUIANO","2314",40,"01131","1003","53","2","CF18203","00.0",8159,"2",null,"20130715","20130930",37211.721000000005,0]
[null,"SAN LUIS POTOSI","24DPT0003S","100","SICJ650205IN3","SICJ650205HSPLSN04","JUAN FELIPE DE JE SILVA CASTILLO","2314",40,"01131","1003","53","2","CF34202","00.0",5113,"2",null,"20130715","20130930",36609.118900000001,0]
[null,"SAN LUIS POTOSI","24DPT0003S","100","SILJ7207131L2","SILJ720713HSPFPN00","JUAN FRANCISCO SIFUENTES LOPEZ","2314",40,"01131","1003","53","2","CF33206","00.0",14532,"2",null,"20130715","20130930",91211.152300000002,0]
[null,"SAN LUIS POTOSI","24DPT0007O","100","LOCJ580721MFC","LOCJ580721HSPMSN00","JUAN IGNACIO LOMELI CASTRO","2314",40,"01131","1003","53","2","CF33206","00.0",14040,"2",null,"20130715","20130930",93534.950200000007,0]
[null,"SAN LUIS POTOSI","24DPT0003S","100","MAMJ560724770","MAMJ560724HSPRRN00","JUAN MANUEL MARTINEZ MARTINEZ","2314",40,"01131","1003","53","2","CF33204","00.0",5101,"2",null,"20130715","20130930",69878.340100000001,0]
[null,"SAN LUIS POTOSI","24DPT0005Q","100","RAGJ5903149W1","RAGJ590314HSPMRN03","JUAN RAMOS GARCIA","2314",40,"01131","1003","53","2","S01202","00.0",3281,"2",null,"20130715","20130930",38377.403300000005,0]
[null,"SAN LUIS POTOSI","24DPT0001U","100","GURJ750624QQ8","GURJ750624MSPTMN05","JUANA GUTIERREZ RAMIREZ","2314",40,"01131","1003","53","2","ED01201","00.0",5627,"2",null,"20130715","20130930",40522.189900000005,0]
[null,"SAN LUIS POTOSI","24DPT0007O","100","MAVJ811117IY1","MAVJ811117MSPRLN08","JUANA ISABEL MARTINEZ VELAZQUEZ","2314",40,"01131","1003","53","2","S01201","00.0",8150,"2",null,"20130715","20130930",23970.523400000002,0]
[null,"SAN LUIS POTOSI","24DPT0009M","","LELJ610303BE8","LELJ610303MSPJPN03","JUANA LEIJA LOPEZ","2314",40,"01131","1003","53","2","S01201","00.0",8149,"2",null,"20130715","20130930",22835.0285,0]
[null,"SAN LUIS POTOSI","24DPT0009M","100","TOCJ611031345","TOCJ611031MSPRRN04","JUANA MARIA TORRES CRUZ","2314",40,"01131","1003","53","2","S01202","00.0",9272,"2",null,"20130715","20130930",36318.733500000002,0]
[null,"SAN LUIS POTOSI","24DPT0007O","100","PAEJ630307MI6","PAEJ630307MSPLSN09","JUANA PALACIOS ESTRADA","2314",40,"01131","1003","53","2","S01201","00.0",8154,"2",null,"20130715","20130930",34358.669000000002,0]
[null,"SAN LUIS POTOSI","24DPT0009X","100","MAEK7710123X3","MAEK771012MSPCLR08","KAREN MACIAS VALADEZ ELIAS","2314",40,"01131","1003","53","2","CF33206","00.0",13131,"2",null,"20130715","20130930",96812.579100000003,0]
[null,"SAN LUIS POTOSI","24DPT0005Q","100","MAML661226UW5","MAML661226MSPRLR04","LAURA ELISA MARTINEZ MELENDEZ","2314",40,"01131","1003","53","2","CF33202","00.0",3274,"2",null,"20130715","20130930",44143.643700000001,0]
[null,"SAN LUIS POTOSI","24DPT0003S","100","MORL810527AT0","MORL810527MSPRDR02","LAURA MARGARITA MORENO RODRIGUEZ","2314",40,"01131","1003","53","2","CF34202","00.0",3328,"2",null,"20130715","20130930",38737.561000000002,0]
[null,"SAN LUIS POTOSI","24DPT0005Q","100","HEAL670226MP7","HEAL670226MSPRCT07","LETICIA HERNANDEZ ACOSTA","2314",40,"01131","1003","53","2","CF34201","00.0",3273,"2",null,"20130715","20130930",45416.5962,0]
[null,"SAN LUIS POTOSI","24DPT0005Q","100","PAFL651004EV0","PAFL651004MSPLLT06","LETICIA PAULIN FLORES","2314",40,"01131","1003","53","2","S01202","00.0",3289,"2",null,"20130715","20130930",34405.313900000001,0]
[null,"SAN LUIS POTOSI","24DPT0001U","100","SARL580921DP4","SARL580921MSPNYL00","LILIANA ARACELI SANCHEZ REYES","2314",40,"01131","1003","53","2","ED01201","00.0",3330,"2",null,"20130715","20130930",41949.765700000004,0]
[null,"SAN LUIS POTOSI","24DPT0003S","100","DETL831214UV7","DETL831214HSPLRC04","LUCIO ISAAC DELGADO TORRES","548",40,"01131","1003","53","2","CF02105","00.0",12813,"5",null,"20130715","20130930",66459.896999999997,0]
[null,"SAN LUIS POTOSI","24DPT0001U","100","VARL840419V1A","VARL840419HSPZDS08","LUIS JAFET VAZQUEZ RODRIGUEZ","2314",40,"01131","1003","53","2","S01201","00.0",3306,"2",null,"20130715","20130930",23330.218400000002,0]
[null,"SAN LUIS POTOSI","24DPT0003S","100","MEBL691213A88","MEBL691213HSPJRS04","LUIS MANUEL MEJORADO BARRAGAN","2314",40,"01131","1003","53","2","S01202","00.0",5114,"2",null,"20130715","20130930",41887.226300000002,0]
[null,"SAN LUIS POTOSI","24DPT0001U","100","VETL800309V15","VETL800309HSPLRS06","LUIS MANUEL VELAZQUEZ TREJO","2314",40,"01131","1003","53","2","S01202","00.0",3325,"2",null,"20130715","20130930",26653.8995,0]
[null,"SAN LUIS POTOSI","24DPT0003S","100","ZASL640121432","ZASL640121MSPVTZ04","LUZ MARIA ZAVALZA STIKER","2314",40,"01131","1003","53","2","CF33204","00.0",9250,"2",null,"20130715","20130930",60159.918900000004,0]
[null,"SAN LUIS POTOSI","24DPT0001U","100","HENC630117DV8","HENC630117MSPRVN09","MA. CONCEPCION HERNANDEZ NAVA","2314",40,"01131","1003","53","2","CF33206","00.0",14531,"2",null,"20130715","20130930",103940.64730000001,0]
[null,"SAN LUIS POTOSI","24DPT0005Q","100","LOMC710712LGA","LOMC710712MSPRDN03","MA. CONSUELO LOREDO MEDINA","2314",40,"01131","1003","53","2","A03202","00.0",3295,"2",null,"20130715","20130930",38237.186300000001,0]
[null,"SAN LUIS POTOSI","24DPT0009M","100","MIFJ490102E61","MIFJ490102MSPRRS07","MA. DE JESUS MIRELES FORTANELLI","2314",40,"01131","1003","53","2","A03202","00.0",9236,"2",null,"20130715","20130930",36434.433199999999,0]
[null,"SAN LUIS POTOSI","24DPT0009X","100","CARA7405111H3","CARA740511MNLSNN11","MA. DE LOS ANGEL CASTILLO RANGEL","548",40,"01131","1003","53","2","CF02100","00.0",12506,"5",null,"20130715","20130930",75764.277000000002,0]
[null,"SAN LUIS POTOSI","24DPT0005Q","100","RAML640920MT9","RAML640920MSPNRR16","MA. DE LOURDES RANGEL MARTINEZ","2314",40,"01131","1003","53","2","CF19201","00.0",3245,"2",null,"20130715","20130930",35967.971799999999,0]
[null,"SAN LUIS POTOSI","24DPT0001U","100","CADR541024LK1","CADR541024MSPSZS05","MA. DEL ROSARIO CASTILLO DIAZ","2314",40,"01131","1003","53","2","T08201","00.0",11307,"2",null,"20130715","20130930",40936.534800000001,0]
[null,"SAN LUIS POTOSI","24DPT0007O","100","SASD751228176","SASD751228MGTNNL02","MA. DOLORES SANCHEZ SANCHEZ","2314",40,"01131","1003","53","2","CF33204","00.0",8938,"2",null,"20130715","20130930",61634.313600000001,0]
[null,"SAN LUIS POTOSI","24DPT0007O","100","GUDE5903131Y1","GUDE590313MSPRZL08","MA. ELVIA GUERRERO DIAZ","2314",40,"01131","1003","53","2","S01202","00.0",8151,"2",null,"20130715","20130930",33067.7762,0]
[null,"SAN LUIS POTOSI","24DPT0001U","100","AARG670120NU4","AARG670120MSPLYD07","MA. GUADALUPE ALMAZAN REYES","2314",40,"01131","1003","53","2","CF33204","00.0",6806,"2",null,"20130715","20130930",63253.157300000006,0]
[null,"SAN LUIS POTOSI","24DPT0005Q","100","OECG711212T95","OECG711212MSPLSD02","MA. GUADALUPE OLVERA CASTILLO","2314",40,"01131","1003","53","2","A03202","00.0",3243,"2",null,"20130715","20130930",38376.871500000001,0]
[null,"SAN LUIS POTOSI","24DPT0009X","100","OAHG511209TY7","OAHG511209MMNRND19","MA. GUADALUPE Y. ORDAZ HUANTE","2314",40,"01131","1003","53","2","CF33206","00.0",11180,"2",null,"20130715","20130930",75094.886500000008,0]
[null,"SAN LUIS POTOSI","24DPT0009M","100","MATG660909AX2","MATG660909MSPRRD06","MA.GUADALUPE MARTINEZ TERAN","2314",40,"01131","1003","53","2","CF33204","00.0",9258,"2",null,"20130715","20130930",69602.619099999996,0]
[null,"SAN LUIS POTOSI","24DPT0005Q","100","JUBM570114M1A","JUBM570114MMNRRC01","MACRINA JUAREZ BARRIGA","2314",40,"01131","1003","53","2","A01801","00.0",32001,"2",null,"20130715","20130930",40604.423600000002,0]
[null,"SAN LUIS POTOSI","24DPT0009X","100","MATM681225M69","MATM681225MSPRRN01","MANUELA MARTINEZ TERAN","2314",40,"01131","1003","53","2","CF33206","00.0",9283,"2",null,"20130715","20130930",85321.297500000001,0]
[null,"SAN LUIS POTOSI","24DPT0009X","100","LEMM840920N55","LEMM840920HSPYDR03","MARCO ANTONIO M. LEYVA MEDINA","2314",40,"01131","1003","53","2","CF33204","00.0",6794,"2",null,"20130715","20130930",52365.184500000003,0]
[null,"SAN LUIS POTOSI","24DPT0005Q","100","RUSM860809AZ3","RUSM860809HSPZLR03","MARCOS LORENZO RUIZ SILVA","2314",40,"01131","1003","53","2","S01201","00.0","3268","2",null,"20130930","20130930",2969.97,0]
[null,"SAN LUIS POTOSI","24DPT0005Q","100","MARM6009139V5","MARM600913MSPTYR07","MARGARITA MATA REYES","2314",40,"01131","1003","53","2","CF04201","00.0",3242,"2",null,"20130715","20130930",36667.767899999999,0]
[null,"SAN LUIS POTOSI","24DPT0003S","100","MECA5608025R7","MECA560802MSPDHN03","MARIA ANGELICA MEDRANO CHAVEZ","2314",40,"01131","1003","53","2","CF18203","00.0",5107,"2",null,"20130715","20130930",42308.414700000001,0]
[null,"SAN LUIS POTOSI","24DPT0005Q","100","DICA6803126P0","DICA680312MSPZNN03","MARIA ANITA DIAZ CONTRERAS","2314",40,"01131","1003","53","2","A03202","00.0",3240,"2",null,"20130715","20130930",37416.685300000005,0]
[null,"SAN LUIS POTOSI","24DPT0009M","100","TOFJ781224GT6","TOFJ781224MSPRLS02","MARIA DE JESUS TORRES FLORES","2314",40,"01131","1003","53","2","S01202","00.0",9254,"2",null,"20130715","20130930",30995.069900000002,0]
[null,"SAN LUIS POTOSI","24DPT0005Q","100","ZARC720415D80","ZARC720415MSPMCR04","MARIA DEL CARMEN ZAMARRON ROCHA","2314",40,"01131","1003","53","2","A03202","00.0",3238,"2",null,"20130715","20130930",33829.658600000002,0]
[null,"SAN LUIS POTOSI","24DPT0009M","100","MEJR550324RF2","MEJR550324MSPLSS05","MARIA DEL ROSARIO MELENDEZ JASSO","2314",40,"01131","1003","53","2","S01201","00.0",9260,"2",null,"20130715","20130930",32349.871200000001,0]
[null,"SAN LUIS POTOSI","24DPT0001U","100","PEIS651209PB0","PEIS651209MSPRBC02","MARIA DEL SOCORRO PEREZ IBARRA","2314",40,"01131","1003","53","2","CF33204","00.0",3331,"2",null,"20130715","20130930",62397.315800000004,0]
[null,"SAN LUIS POTOSI","24DPT0005Q","100","BABD811223FSA","BABD811223MSPZNL05","MARIA DOLORES BAEZ BANDA","2314",40,"01131","1003","53","2","CF21202","00.0",3265,"2",null,"20130715","20130930",36490.911500000002,0]
[null,"SAN LUIS POTOSI","24DPT0005Q","100","VIBE670614TR4","VIBE670614MSPLNL00","MARIA ELEAZAR VILLELA BUENO","2314",40,"01131","1003","53","2","CF33203","00.0",3291,"2",null,"20130715","20130930",44463.302200000006,0]
[null,"SAN LUIS POTOSI","24DPT0009M","100","UOAE5801257F6","UOAE580125MSPLLL00","MARIA ELVIRA ULLOA ALVAREZ","2314",40,"01131","1003","53","2","S01202","00.0",9275,"2",null,"20130715","20130930",36821.402500000004,0]
[null,"SAN LUIS POTOSI","24DPT0005Q","100","BARG670418KM6","BARG670418MSPZMD01","MARIA GUADALUPE BAEZ RAMIREZ","2314",40,"01131","1003","53","2","CF33204","00.0",3272,"2",null,"20130715","20130930",70707.660499999998,0]
[null,"SAN LUIS POTOSI","24DPT0005Q","100","AOAM760119SL9","AOAM760119MDFLRR09","MARIANA ALONSO ARROYO","2314",40,"01131","1003","53","2","CF33204","00.0",8155,"2",null,"20130715","20130930",46491.080500000004,0]
[null,"SAN LUIS POTOSI","24DPT0009M","100","MAGM710703LS8","MAGM710703MSPRTR04","MARILU MARTINEZ GUTIERREZ","2314",40,"01131","1003","53","2","CF33206","00.0",14042,"2",null,"20130715","20130930",92354.391199999998,0]
[null,"SAN LUIS POTOSI","24DPT0005Q","100","GUHM580226452","GUHM580226MSPTRR02","MARTHA DE LA CRUZ GUTIERREZ HERNANDEZ","2314",40,"01131","1003","53","2","CF33204","00.0",3260,"2",null,"20130715","20130930",70023.749500000005,0]
[null,"SAN LUIS POTOSI","24DPT0003S","100","MIEM640812V46","MIEM640812MCLJSR01","MARTHA FABIANA MIJARES ESPINOZA","2314",40,"01131","1003","53","2","CF33204","00.0",8152,"2",null,"20130715","20130930",64846.090900000003,0]
[null,"SAN LUIS POTOSI","24DPT0001U","100","CAMM550517IH3","CAMM550517HSPSRR03","MAURICIO CASTILLO MORALES","2314",40,"01131","1003","53","2","A03202","00.0",3298,"2",null,"20130715","20130930",38611.056700000001,0]
[null,"SAN LUIS POTOSI","24DPT0003S","","PERM920321B89","PERM920321HSPXML06","MELCHOR IVAN PEÑA RAMIREZ","2314",40,"01131","1003","53","2","S01201","00.0",5103,"2",null,"20130715","20130930",18969.5085,0]
[null,"SAN LUIS POTOSI","24DPT0005Q","100","AOCM540706DF7","AOCM540706HSPLVG04","MIGUEL AGUSTIN ALONSO CUEVAS","2314",40,"01131","1003","53","2","CF21202","00.0",12113,"2",null,"20130715","20130930",43248.613700000002,0]
[null,"SAN LUIS POTOSI","24DPT0009X","100","CACM531122I50","CACM531122HSPMMG19","MIGUEL CAMPOS CAMBRANIS","548",40,"01131","1003","53","2","CF11100","00.0",12448,"5",null,"20130715","20130930",236416.32,0]
[null,"SAN LUIS POTOSI","24DPT0007O","100","SAGM540516420","SAGM540516MMCNMN07","MINERVA ANA MARIA SANCHEZ GOMEZ","2314",40,"01131","1003","53","2","CF34201","00.0",8145,"2",null,"20130715","20130930",36567.970600000001,0]
[null,"SAN LUIS POTOSI","24DPT0001U","100","FOHM651218DV0","FOHM651218HSPLRS09","MOISES FLORES HERNANDEZ","548",40,"01131","1003","53","2","D004","00.0",3300,"5",null,"20130715","20130930",85992.471000000005,0]
[null,"SAN LUIS POTOSI","24DPT0009X","100","MUMM660415DR9","MUMM660415HGTXRS07","MOISES MUÑIZ MARQUEZ","548",40,"01131","1003","53","2","CF02100","00.0",12508,"5",null,"20130715","20130930",75764.277000000002,0]
[null,"SAN LUIS POTOSI","24DPT0001U","","LOMM890219AB3","LOMM890219MSPPTN09","MONICA SELENA LOPEZ MATA","2314",40,"01131","1003","53","2","CF34202","00.0","12054","2",null,"20130831","20130831",3570.1840000000002,0]
[null,"SAN LUIS POTOSI","24DPT0005Q","100","ROMN380628S80","ROMN380628HSPDTC04","NICOLAS RODRIGUEZ MATA","2314",40,"01131","1003","53","2","S01201","00.0",3285,"2",null,"20130715","20130930",35700.699400000005,0]
[null,"SAN LUIS POTOSI","24DPT0003S","","SAHN7508099U9","SAHN750809MSPCRR08","NORMA DELIA SAUCEDA HERNANDEZ","2314",40,"01131","1003","53","2","S01201","00.0",5098,"2",null,"20130715","20130930",21870.113100000002,0]
[null,"SAN LUIS POTOSI","24DPT0009M","100","LUMO660710AW4","LUMO660710MSPNRF02","OFELIA LUNA MORA","2314",40,"01131","1003","53","2","S01202","00.0",9257,"2",null,"20130715","20130930",34413.6394,0]
[null,"SAN LUIS POTOSI","24DPT0009M","100","MOBO7207294K1","MOBO720729MSPRDF04","OFELIA MORALES BADILLO","2314",40,"01131","1003","53","2","T08201","00.0",9261,"2",null,"20130715","20130930",43293.216800000002,0]
[null,"SAN LUIS POTOSI","24DPT0001U","100","REMO730405JA0","REMO730405MVZDTJ15","OJILVIA REDONDO MATEOS","2314",40,"01131","1003","53","2","CF33204","00.0",3314,"2",null,"20130715","20130930",62131.144100000005,0]
[null,"SAN LUIS POTOSI","24DPT0005Q","100","GOFO750504S66","GOFO750504MSPNZR00","ORYANA VANESSA GONZALEZ FAZ","2314",40,"01131","1003","53","2","CF33206","00.0",13132,"2",null,"20130715","20130930",98302.968399999998,0]
[null,"SAN LUIS POTOSI","24DPT0001U","100","TEBO821119NQ5","TEBO821119HHGRLS07","OSCAR TREJO BELTRAN","2314",40,"01131","1003","53","2","S01201","00.0",3310,"2",null,"20130715","20130930",26829.163400000001,0]
[null,"SAN LUIS POTOSI","24DPT0005Q","100","HEHP770124UI6","HEHP770124HSPRRD02","PEDRO HERNANDEZ HERNANDEZ","2314",40,"01131","1003","53","2","S01202","00.0",3283,"2",null,"20130715","20130930",33829.550200000005,0]
[null,"SAN LUIS POTOSI","24DPT0007O","100","MEOP540116RN1","MEOP540116HSPXLR06","PORFIRIO MEXICANO OLIVA","2314",40,"01131","1003","53","2","CF21202","00.0",8150,"2",null,"20130715","20130930",39743.015599999999,0]
[null,"SAN LUIS POTOSI","24DPT0009M","100","RILR531105JV6","RILR531105HSPVPF03","RAFAEL RIVERA LOPEZ","2314",40,"01131","1003","53","2","S01202","00.0",9267,"2",null,"20130715","20130930",38358.168300000005,0]
[null,"SAN LUIS POTOSI","24DPT0005Q","100","SAGR701024AV1","SAGR701024HSPLLF07","RAFAEL SALAS GALAVIZ","2314",40,"01131","1003","53","2","S01201","00.0",158,"2",null,"20130715","20130930",27594.4725,0]
[null,"SAN LUIS POTOSI","24DPT0009M","100","AELR680504JA6","AELR680504HSPLRM09","RAMIRO ALMENDARIZ LOREDO","2314",40,"01131","1003","53","2","CF33204","00.0",9238,"2",null,"20130715","20130930",67092.69690000001,0]
[null,"SAN LUIS POTOSI","24DPT0003S","100","AAHR590313BP3","AAHR590313HSPLRM03","RAMIRO ALVARADO HERRERA","2314",40,"01131","1003","53","2","CF33204","00.0",5089,"2",null,"20130715","20130930",74808.320900000006,0]
[null,"SAN LUIS POTOSI","24DPT0005Q","100","RAGR661201RT1","RAGR661201HSPMRM02","RAMON RAMOS GARCIA","2314",40,"01131","1003","53","2","S01202","00.0",3282,"2",null,"20130715","20130930",35320.7958,0]
[null,"SAN LUIS POTOSI","24DPT0003S","100","ROAR710803LR5","ROAR710803HSPJLL08","RAUL ROJAS ALVARADO","2314",40,"01131","1003","53","2","CF33204","00.0",9248,"2",null,"20130715","20130930",67724.051300000006,0]
[null,"SAN LUIS POTOSI","24DPT0005Q","100","MAOR6107121R7","MAOR610712HSPRRN06","RENE MARTINEZ ORTIGOZA","2314",40,"01131","1003","53","2","CF33204","00.0",9266,"2",null,"20130715","20130930",66718.5144,0]
[null,"SAN LUIS POTOSI","24DPT0003S","100","MEBR7304207S1","MEBR730420HSPJRY02","REYNALDO MEJORADO BARRAGAN","2314",40,"01131","1003","53","2","S01201","00.0",5110,"2",null,"20130715","20130930",19172.968500000003,0]
[null,"SAN LUIS POTOSI","24DPT0009M","100","SARI650522GIA","SAXR650522MDGPXT03","RITA SAPATA .","2314",40,"01131","1003","53","2","CF34201","00.0",9273,"2",null,"20130715","20130930",35124.020799999998,0]
[null,"SAN LUIS POTOSI","24DPT0005Q","100","RORR520329DU7","RORR520329HTSJVB07","ROBERTO ROJAS RIVERO","2314",40,"01131","1003","53","2","CF18203","00.0",3286,"2",null,"20130715","20130930",46086.0118,0]
[null,"SAN LUIS POTOSI","24DPT0009X","100","AAMR760716SI1","AAMR760716MSPRLC06","ROCIO DEL CARMEN ARAUJO MELENDEZ","2314",40,"01131","1003","53","2","CF33206","00.0",11186,"2",null,"20130715","20130930",88275.55260000001,0]
[null,"SAN LUIS POTOSI","24DPT0009M","100","RORR811129MR5","RORR811129MSPCDC01","ROCIO ROCHA RODRIGUEZ","2314",40,"01131","1003","53","2","CF04201","00.0",8139,"2",null,"20130715","20130930",33574.462500000001,0]
[null,"SAN LUIS POTOSI","24DPT0005Q","100","TEDR630916EX2","TEDR630916HSPLZG06","ROGELIO MARTIN TELLO DIAZ","2314",40,"01131","1003","53","2","A03202","00.0",3241,"2",null,"20130715","20130930",40282.805,0]
[null,"SAN LUIS POTOSI","24DPT0009M","100","MAMR710125SH6","MAMR710125MMCDNB03","RUBI GUADALUPE MADRIGAL MENDEZ","2314",40,"01131","1003","53","2","CF33206","00.0",13801,"2",null,"20130715","20130930",103667.34420000001,0]
[null,"SAN LUIS POTOSI","24DPT0005Q","100","GUPS4410229S8","GUPS441022HSPJNL01","SALOMON FRANCISCO GUAJARDO PUENTE","2314",40,"01131","1003","53","2","S01201","00.0",3261,"2",null,"20130715","20130930",37101.6005,0]
[null,"SAN LUIS POTOSI","24DPT0009X","100","MEES680705HB4","MEES680705MNLNSR09","SARA MENDOZA ESPINOSA","2314",40,"01131","1003","53","2","CF33204","00.0",5379,"2",null,"20130715","20130930",69153.094899999996,0]
[null,"SAN LUIS POTOSI","24DPT0001U","100","SAHS851106JW8","SAHS851106MSPNRL02","SELENE MILAGROS SANCHEZ HERNANDEZ","2314",40,"01131","1003","53","2","CF33206","00.0",13944,"2",null,"20130715","20130930",67614.056500000006,0]
[null,"SAN LUIS POTOSI","24DPT0001U","100","LEGS740525K51","LEGS740525HSPLNR07","SERGIO LEAL GONZALEZ","2314",40,"01131","1003","53","2","CF33206","00.0",13857,"2",null,"20130715","20130930",97045.770600000003,0]
[null,"SAN LUIS POTOSI","24DPT0001U","100","PUCS731008NE9","PUCS731008HSPRRR06","SERGIO PURATA CRUZ","2314",40,"01131","1003","53","2","S01202","00.0",3334,"2",null,"20130715","20130930",32071.202600000001,0]
[null,"SAN LUIS POTOSI","24DPT0003S","100","SIRS660627HNA","SIRS660627HSPRJR03","SERGIO SIRENO ROJAS","2314",40,"01131","1003","53","2","CF19201","00.0",5102,"2",null,"20130715","20130930",36722.753499999999,0]
[null,"SAN LUIS POTOSI","24DPT0005Q","100","LOMS671103K68","LOMS671103MSPYXL06","SILVIA LAURA LOYOLA MEXICANO","2314",40,"01131","1003","53","2","CF34202","00.0",3269,"2",null,"20130715","20130815",15004.163500000001,0]
[null,"SAN LUIS POTOSI","24DPT0005Q","100","GOMS6204091U8","GOMS620409MSPNNL00","SILVIA MARGARITA GONZALEZ MONJARAS","2314",40,"01131","1003","53","2","CF33206","00.0",13798,"2",null,"20130715","20130930",75094.886500000008,0]
[null,"SAN LUIS POTOSI","24DPT0001U","100","SARS600827T73","SARS600827HSPNYX08","SIXTO ARMANDO SANCHEZ REYES","2314",40,"01131","1003","53","2","ED01201","00.0",3329,"2",null,"20130715","20130930",34031.285600000003,0]
[null,"SAN LUIS POTOSI","24DPT0007O","100","JAGT620724585","JAGT620724MSPMMR02","TERESA JAIME GOMEZ","2314",40,"01131","1003","53","2","CF19201","00.0",8160,"2",null,"20130715","20130930",37118.950300000004,0]
[null,"SAN LUIS POTOSI","24DPT0003S","100","MADV800530Q43","MADV800530MSPRLR06","VERONICA IVETTE MARTINEZ DELGADO","2314",40,"01131","1003","53","2","CF33203","00.0",5109,"2",null,"20130715","20130930",36058.8223,0]
[null,"SAN LUIS POTOSI","24DPT0009X","100","JADV701114SJ4","JADV701114MSPSZR05","VERONICA JASSO DIAZ","2314",40,"01131","1003","53","2","CF33204","00.0",3284,"2",null,"20130715","20130930",72108.695399999997,0]
[null,"SAN LUIS POTOSI","24DPT0003S","100","AAEV820708KG1","AAEV820708MSPLSN04","VIANEY ALVAREZ ESTRADA","2314",40,"01131","1003","53","2","CF33204","00.0",9247,"2",null,"20130715","20130930",55066.248400000004,0]
[null,"SAN LUIS POTOSI","24DPT0009M","100","GAMV520122GS8","GAMV520122HSPRRC02","VICENTE GARCIA MORENO","2314",40,"01131","1003","53","2","A03202","00.0",9239,"2",null,"20130715","20130930",39892.914000000004,0]
[null,"SAN LUIS POTOSI","24DPT0001U","100","HEJV7203106N5","HEJV720310HSPRRC02","VICENTE HERRERA JUAREZ","2314",40,"01131","1003","53","2","S01202","00.0",3309,"2",null,"20130715","20130930",27042.6695,0]
[null,"SAN LUIS POTOSI","24DPT0009M","100","ROAV540405B30","ROAV540405HSPCLC05","VICENTE ROCHA ALVARADO","2314",40,"01131","1003","53","2","CF33204","00.0",3271,"2",null,"20130715","20130930",72017.055800000002,0]
[null,"SAN LUIS POTOSI","24DPT0003S","100","SAHV7005203N4","SAHV700520HSPLRC05","VICTOR HUGO SALAZAR HERRERA","2314",40,"01131","1003","53","2","CF33206","00.0",13946,"2",null,"20130715","20130930",90072.577700000009,0]
[null,"SAN LUIS POTOSI","24DPT0001U","100","DEGV660220PV1","DEGV660220MSPLNR02","VIRGINIA DELGADO GONZALEZ","2314",40,"01131","1003","53","2","CF33206","00.0",13854,"2",null,"20130715","20130930",108411.11450000001,0]
[null,"SAN LUIS POTOSI","24DPT0001U","100","SAVY6603309K7","SAVY660330MSPNLL09","YOLANDA SANCHEZ VALENZUELA","2314",40,"01131","1003","53","2","CF33206","00.0",14530,"2",null,"20130715","20130930",112480.8818,0]
[null,"SAN LUIS POTOSI","24DPT0009M","100","LOFY8312272NS","LOFY831227MSPPZS08","YOSHELYN ESTHER LOPEZ FAZ","2314",40,"01131","1003","53","2","S01201","00.0",9256,"2",null,"20130715","20130930",29378.482600000003,0]
[]
[]
[null,"Total Personas : ",null,170,null,null,null,null,null,null,null,null,null,"Total Plazas : ",null,165,null,null,"Total Pto. Federal",null,{"$f":"SUBTOTAL(109,Tabla12[Percepciones pagadas en el Periodo de Comisión con Presupuesto Federal*])","v":9065412.6481000036}]
[]
[null,"NOTA: INCLUYE EL PAGO DEL RETROACTIVO AL INCREMENTO SALARIAS DEL 3.9% AL PERSONAL ADMINISTRATIVO TÉCNICO Y MANUAL (BASE Y CONFIANZA)",null,null,null,null,null,null,null,null,null,null,null,null,null,null,null,null,"Total Ppto. Otras Fuentes:",null,null,{"$f":"SUM(V16:V189)","v":0}]
[null,"NOTA: LOS TRABAJADORES ACADÉMICOS FUERON BASIFICADOS EN EL ESTADO, EL ESQUEMA DE PAGO ES MIXTO, YA QUE SE PAGAN 4715 HORAS SEMANA MES CON PRESUPUESTO FEDERAL (3288 HSM AL 100% Y 1427 AL 50%, ESTAS ÚLTIMAS CORRESPONDEN A INCREMENTOS A PARTIR DE LA FEDERALIZACIÓN), LAS DIFERENCIAS DE HORAS ASÍ COMO LAS PRESTACIONES DEL CONTRTATO COLECTIVO DE TRABAJO Y LA SEGURIDAD SOCIAL SE PAGA CON INGRESOS PROPIOS Y/O CON APORTACIÓN ESTATAL (VER FORMATO II D) 6)"]
[]
[null,"*Total de Percepciones reportadas por la Entidad Federativa como pagadas al trabajador durante la comisión."]
[null,"Fuente : Información proporcionada por las Entidades Federativas"]

{"sheet":"II D) 2","index":6,"n_rows":35,"n_cols":19,"rows_kept":35,"cut":false,"hidden":false,"merged":[[11,16,12,16],[11,15,12,15],[11,17,12,17],[11,18,12,18],[11,6,11,12],[11,13,12,13],[11,14,12,14],[8,1,8,9],[11,0,12,0],[11,1,12,1],[11,5,12,5],[11,2,12,2],[11,3,12,3],[11,4,12,4]]}
[]
[]
[]
[]
[]
[]
[]
[null,"Formato: Movimientos de Plazas"]
[null,{"$f":"IF('Caratula Resumen'!D22=\"Elige el Periodo…\",\"\",'Caratula Resumen'!D22)","v":"Fondo de Aportaciones para la Educación Tecnológica y de Adultos/Colegio Nacional de Educación Profesional Técnica (FAETA/CONALEP)"},null,null,null,null,null,null,null,null,null,null,null,null,null,null,null,{"$f":"IF('Caratula Resumen'!D23=\"Elige el Periodo…\",\"\",'Caratula Resumen'!D23)","v":"3er. Trimestre"}]
[]
[]
[null,"Entidad Federativa","RFC","CURP","Nombre","Origen Presupuestal\n de la plazas","Clave Presupuestal",null,null,null,null,null,null,"Clave de nivel de puesto","Clave de nivel de sueldo","Zona Económica","Tipo de movimiento","Quincena Inicial","Quincena Final"]
[null,null,null,null,null,null,"Partida Presupuestal","Código de Pago","Clave de Unidad","Clave de Sub Unidad","Clave de Categoría","Horas Semana Mes ","Número de Plaza"]
[]
[null,"Entidad Federativa","RFC","CURP","Nombbre","Origen Presupuestal\n de la plazas","Partida Presupuestal","Código de Pago","Clave de Unidad","Clave de Sub Unidad","Clave de Categoría","Horas semana mes","Número de plaza","Clave de nivel de puesto","Clave de nivel de sueldo","Zona Económica","Tipo de movimiento","Quincena Inicial","Quincena Final"]
[null,"SAN LUIS POTOSI","HUEE8802101U6","HUEE880210MSPRSS07","ESMERALDA HUERTA ESPINO","1","01131","1003","53","2","CF34202","00.0","12054","05","3","B","1","201317","999999"]
[null,"SAN LUIS POTOSI","TUBA630811ME9","TUBA630811HSPDLL18","ALAYN TUDON BALDAZO","1","01131","1003","53","2","S01201","00.0","9254","02","3","B","1","201314","999999"]
[null,"SAN LUIS POTOSI","LOMM890219AB3","LOMM890219MSPPTN09","MONICA SELENA LOPEZ MATA","1","01131","1003","53","2","CF34202","00.0","12054","05","3","B","1","201316","999999"]
[null,"SAN LUIS POTOSI","GACA8606041K6","GACA860604HSPRSD08","ADRIAN GARCIA CASTILLO","1","01131","1003","53","2","S01201","00.0","3281","05","4","B","1","201317","999999"]
[null,"SAN LUIS POTOSI","RUSM860809AZ3","RUSM860809HSPZLR03","MARCOS LORENZO RUIZ SILVA","1","01131","1003","53","2","S01201","00.0","3268","02","3","B","1","201318","999999"]
[null,"SAN LUIS POTOSI","LOMS671103K68","LOMS671103MSPYXL06","SILVIA LAURA LOYOLA MEXICANO","1","01131","1003","53","2","CF34202","00.0","3328","05","3","B","2","198909",201315]
[null,"SAN LUIS POTOSI","DIFA410704P57","DIFA410704MTSZLL01","ALICIA DIAZ FLORES","1","01131","1003","53","2","A03202","00.0","9234","05","3","B","2","200211",201313]
[null,"SAN LUIS POTOSI","GAAF571004N86","GAAF571004HSPRRR07","FRANCISCO JAVIER GARCIA AREVALO","1","01131","1003","53","2","A03202","00.0","9234","05","3","B","3","198518","201318"]
[null,"SAN LUIS POTOSI","LOMS671103K68","LOMS671103MSPYXL06","SILVIA LAURA LOYOLA MEXICANO","1","01131","1003","53","2","CF34202","00.0","3328","05","3","B","3","198909","201315"]
[null,"SAN LUIS POTOSI","DIFA410704P57","DIFA410704MTSZLL01","ALICIA DIAZ FLORES","1","01131","1003","53","2","A03202","00.0","9234","05","3","B","3","200211","201313"]
[null,"SAN LUIS POTOSI","TOFJ781224GT6","TOFJ781224MSPRLS02","MARIA DE JESUS TORRES FLORES","1","01131","1003","53","2","S01202","00.0","9245","04","4","B","3","200621","201318"]
[null,"SAN LUIS POTOSI","ROMJ691226UG8","ROMT691226HSPDLM00","JOSE TOMAS RODRIGUEZ MALDONADO","1","01131","1003","53","2","CF34202","00.0","12054","05","3","B","3","201306","201318"]
[]
[]
[]
[null,"Total Personas : ",12,null,null,null,null,null,null,null,"Total Plazas : ",null,6]
[]
[]
[]
[null,"Fuente : Información proporcionada por las Entidades Federativas"]

{"sheet":"II D) 4","index":7,"n_rows":23,"n_cols":17,"rows_kept":23,"cut":false,"hidden":false,"merged":[[12,16,13,16],[12,5,13,5],[12,4,13,4],[12,3,13,3],[9,1,9,9],[19,13,19,14],[12,0,13,0],[12,6,13,6],[12,7,12,13],[12,14,12,15],[12,2,13,2],[12,1,13,1]]}
[]
[]
[]
[]
[]
[]
[]
[]
[null,"Formato: Trabajadores Jubilados en el Periodo"]
[null,{"$f":"IF('Caratula Resumen'!D22=\"Elige el Periodo…\",\"\",'Caratula Resumen'!D22)","v":"Fondo de Aportaciones para la Educación Tecnológica y de Adultos/Colegio Nacional de Educación Profesional Técnica (FAETA/CONALEP)"},null,null,null,null,null,null,null,null,null,null,null,null,null,{"$f":"IF('Caratula Resumen'!D23=\"Elige el Periodo…\",\"\",'Caratula Resumen'!D23)","v":"3er. Trimestre"}]
[]
[]
[null,"Entidad Federativa","R.F.C.","CURP","NOMBRE","Clave CT","Última(s) ó Penultima(s) Plaza(s) Ocupada(s)\n(*)","Clave Presupuestal de la Jubilación",null,null,null,null,null,null,"Periodo ocupado",null,"Quincena de inicio de jubilación"]
[null,null,null,null,null,null,null,"Partida Presupuestal","Código de Pago","Clave de Unidad","Clave de Sub Unidad","Clave de Categoría","Horas Semana Mes ","Número de Plaza","Inicio","Conclusión"]
[]
[null,"Entidad Federativa","R.F.C.","CURP","NOMBRE","Clave Centro de Trabajo","Última(s) ó Penultima(s) Plaza(s) Ocupada(s)\n(*)","Partida Presupuestal","Código de Pago","Clave de Unidad","Clave de Sub Unidad","Clave de Categoría","Horas Semana Mes ","Número de Plaza","Periodo ocupado\nInicio","Periodo ocupado\nConclusión","Quincena de inicio de jubilación"]
[null,"SAN LUIS POTOSI","DIFA410704P57","DIFA410704MTSZLL01","ALICIA DIAZ FLORES","24DPT0009M",1,"01131","1003","53","2","A03202","00.0","9234","200211",201313,201314]
[null,"Total Personas : ",1,null,null,null,null,null,null,null,null,"Total Plazas : ",null,1]
[]
[]
[]
[null,"Fuente : Información proporcionada por las Entidades Federativas"]
[null,"(*) Si  el trabajador se jubila con más de una clave presupuestal, por cada plaza se debe llenar un registro hasta que se haya informado acerca de todas las plazas del trabajador."]

{"sheet":"II D) 4 A","index":8,"n_rows":23,"n_cols":18,"rows_kept":23,"cut":false,"hidden":false,"merged":[[17,13,17,14],[9,1,9,7],[19,13,19,14],[12,17,13,17],[12,1,13,1],[12,2,13,2],[12,3,13,3],[12,4,13,4],[12,5,13,5],[12,6,12,12],[12,13,12,14],[12,15,13,15],[12,16,13,16]]}
[]
[]
[]
[]
[]
[]
[]
[]
[null,"Formato: Trabajadores que Tramitaron Licencia Prejubilatoria en el Periodo"]
[null,{"$f":"IF('Caratula Resumen'!D22=\"Elige el Periodo…\",\"\",'Caratula Resumen'!D22)","v":"Fondo de Aportaciones para la Educación Tecnológica y de Adultos/Colegio Nacional de Educación Profesional Técnica (FAETA/CONALEP)"},null,null,null,null,null,null,null,null,null,null,null,null,null,null,null,{"$f":"IF('Caratula Resumen'!D23=\"Elige el Periodo…\",\"\",'Caratula Resumen'!D23)","v":"3er. Trimestre"}]
[]
[]
[null,"Entidad Federativa","R.F.C.","CURP","NOMBRE","Clave integrada","Clave Presupuestal",null,null,null,null,null,null,"Periodo Licencia",null,"Percepciones pagadas con Presupuesto Federal en el  Periodo reportado*","Percepciones pagadas con Presupuesto de otra Fuente en el  Periodo reportado*","Clave CT Origen"]
[null,null,null,null,null,null,"Partida Presupuestal","Código de Pago","Clave de Unidad","Clave de Sub Unidad","Clave de Categoría","Horas Semana Mes ","Número de Plaza","Inicio","Conclusión"]
[]
[null,"Entidad Federativa","R.F.C.","CURP","NOMBRE","Clave integrada","Partida Presupuestal","Código de Pago","Clave de Unidad","Clave de Sub Unidad","Clave de Categoría","Horas Semana Mes ","Número de Plaza","Periodo Licencia\nInicio","Periodo Licencia\nConclusión","Percepciones pagadas con Presupuesto Federal en el  Periodo reportado*","Percepciones pagadas con Presupuesto de otra Fuente en el  Periodo reportado*","Clave CT Origen"]
[]
[null,"Total Personas : ",null,null,null,null,null,null,null,null,"Total Plazas : ",null,null,"Total Pto. Federal"]
[]
[null,"NO APLICA PARA ESTE ORGANISMO PARA EL TERCER TRIMESTRE DEL 2013",null,null,null,null,null,null,null,null,null,null,null,"Total Ppto. Otras Fuentes"]
[]
[null,"*Total de Percepciones reportadas por la Entidad Federativa como pagadas en el periodo "]
[null,"Fuente : Información proporcionada por las Entidades Federativas"]

{"sheet":"II D) 6","index":9,"n_rows":388,"n_cols":13,"rows_kept":388,"cut":false,"hidden":false,"merged":[[383,1,386,6],[10,1,10,6],[13,12,14,12],[13,9,13,10],[13,11,14,11],[13,1,14,1],[13,2,14,2],[13,3,14,3],[13,4,14,4],[13,5,14,5],[13,6,14,6],[13,7,13,8]]}
[]
[]
[]
[]
[]
[]
[]
[]
[]
[null,"Formato: Trabajadores Contratados por Honorarios en el Periodo"]
[null,{"$f":"IF('Caratula Resumen'!D22=\"Elige el Periodo…\",\"\",'Caratula Resumen'!D22)","v":"Fondo de Aportaciones para la Educación Tecnológica y de Adultos/Colegio Nacional de Educación Profesional Técnica (FAETA/CONALEP)"},null,null,null,null,null,null,null,null,null,null,{"$f":"IF('Caratula Resumen'!D23=\"Elige el Periodo…\",\"\",'Caratula Resumen'!D23)","v":"3er. Trimestre"}]
[]
[]
[null,"Entidad Federativa","Clave Centro de Trabajo","R.F.C.","CURP","Nombre","Identificador del Contrato","Equivalencia",null,"Periodo de Contratación",null,"Función","Percepciones pagadas dentro del periodo reportado"]
[null,null,null,null,null,null,null,"Clave de Categoría","Horas Semana Mes ","Inicio","Conclusión"]
[]
[null,"Entidad Federativa","Clave Centro de Trabajo","R.F.C.","CURP","Nombre","Identificador del Contrato","Clave de Categoría","Horas Semana Mes ","Periodo de Contratación\nInicio","Periodo de Contratación\nConclusión","Función","Percepciones pagadas dentro del periodo reportado"]
[null,"SAN LUIS POTOSI","24DPT0001U","MOCA671120BJ1","MOCA671120MSPNSD04","ADELA MONROY CASTILLO",2462524044,"PB",20,20130207,20130628,"DOCENTE FRENTE A GRUPO",13083.86]
[null,"SAN LUIS POTOSI","24DPT0001U","PAGA641218772","PAGA641218HSPTRG09","AGRACIANO PAITA GARCIA",0,"PC",20,20130207,20130628,"DOCENTE FRENTE A GRUPO",15024.32]
[null,"SAN LUIS POTOSI","24DPT0001U","GOZA820215BL6","GOZA820215MSPNML05","ALEJANDRA GONZALEZ ZAMORA",0,"PA",17,20130207,20130628,"DOCENTE FRENTE A GRUPO",4417.05]
[null,"SAN LUIS POTOSI","24DPT0001U","AUFA630503DX7","AUFA630503HSPGRL08","ALEJANDRO AGUILAR FERNANDEZ",0,"PC",20,20130207,20130628,"DOCENTE FRENTE A GRUPO",9583.8299999999981]
[null,"SAN LUIS POTOSI","24DPT0001U","LAAA81021221A","LAAA810212HSPRLL05","ALFREDO LARA ALVAREZ",0,"PA",18,20130207,20130628,"DOCENTE FRENTE A GRUPO",5164.7099999999991]
[null,"SAN LUIS POTOSI","24DPT0001U","POLA651003BG8","POLA651003MVZRRL02","ALMA DELIA PORTILLA LARA",0,"PA",20,20130207,20130628,"DOCENTE FRENTE A GRUPO",19008.82]
[null,"SAN LUIS POTOSI","24DPT0001U","GACA680719NP9","GACA680719MSPLSN09","ANA DELIA GALLEGOS CASTAÑEDA",0,"PC",20,20130207,20130628,"DOCENTE FRENTE A GRUPO",24430.11]
[null,"SAN LUIS POTOSI","24DPT0001U","DUCA550723HA8","DUCA550723MSPRHN06","ANA MARIA DUARTE CHAVEZ",0,"PA",14,20130812,99999999,"DOCENTE FRENTE A GRUPO",3871.7599999999998]
[null,"SAN LUIS POTOSI","24DPT0001U","DUCA550723HA8","DUCA550723MSPRHN06","ANNA MARÍA DUARTE CHAVEZ",0,"PA",17,20130207,20130628,"DOCENTE FRENTE A GRUPO",4603.9799999999996]
[null,"SAN LUIS POTOSI","24DPT0001U","FEIA650129TV7","FEIA650129HSPRZQ03","AQUILES FERNANDEZ IZAGUIRRE",0,"PC",20,20130207,20130628,"DOCENTE FRENTE A GRUPO",21800.640000000003]
[null,"SAN LUIS POTOSI","24DPT0001U","EICA671114M66","EICA671114MSPSSR06","ARACELI CASTILLO ESPINOSA",0,"PA",12,20130812,99999999,"DOCENTE FRENTE A GRUPO",3122.0299999999997]
[null,"SAN LUIS POTOSI","24DPT0001U","OEMA640824146","OEMA640824MSPRRR09","AUREA ORTEGA MARTINEZ",0,"TA",20,20130207,20130628,"DOCENTE FRENTE A GRUPO",16586.72]
[null,"SAN LUIS POTOSI","24DPT0001U","VEFC760726CG9","VEFC760726MSPGNR08","CAROLINA VEGA FUENTES",0,"TA",18,20130207,20130628,"DOCENTE FRENTE A GRUPO",3857.95]
[null,"SAN LUIS POTOSI","24DPT0001U","RAMC620706QN2","RAMC620706HSPMDS09","CESAREO RAMIREZ MEDINA",0,"PC",20,20130207,20130628,"DOCENTE FRENTE A GRUPO",18215.39]
[null,"SAN LUIS POTOSI","24DPT0001U","SOLD660417GY5","SOLD660417MSPTNR02","DORA SILVIA SOTO DE LEON",0,"PC",20,20130207,20130628,"DOCENTE FRENTE A GRUPO",21445.9]
[null,"SAN LUIS POTOSI","24DPT0001U","TEGD790912B79","TEGD790912MSPRNL09","DULCE MARIA TREJO GONZALEZ",0,"PB",20,20130207,20130628,"DOCENTE FRENTE A GRUPO",21367.860000000004]
[null,"SAN LUIS POTOSI","24DPT0001U","ROME710215117","ROME710215MSPJYL08","ELIA ARACELI ROJO MAYA",0,"PA",20,20130207,20130628,"DOCENTE FRENTE A GRUPO",8662.8499999999985]
[null,"SAN LUIS POTOSI","24DPT0001U","TONE7403103J6","TONE740310HSPVTL06","ELICER TOVAR NIETO",0,"PB",20,20130207,20130628,"DOCENTE FRENTE A GRUPO",21432.81]
[null,"SAN LUIS POTOSI","24DPT0001U","SAPE711122AK5","SAPE711122HSPMLL00","ELOI SAMANO PONCE",0,"PA",20,20130207,20130628,"DOCENTE FRENTE A GRUPO",19920.490000000002]
[null,"SAN LUIS POTOSI","24DPT0001U","EARE6710027E0","EARE671002MSPSNS06","ESTHER ESCALANTE RANGEL",0,"PA",20,20130207,20130628,"DOCENTE FRENTE A GRUPO",20078.39]
[null,"SAN LUIS POTOSI","24DPT0001U","MUCE500527AZA","MUCE500527MSPNRS08","ESTHER MUNGUIA CERVANTES",2462524044,"PA",20,20130207,20130628,"DOCENTE FRENTE A GRUPO",213.21999999999997]
[null,"SAN LUIS POTOSI","24DPT0001U","TEAE760114MP","TEAE760114MSPJRT07","ETNA CLEOTILDE DE LA TEJA ARVIZU",0,"PA",20,20130207,20130628,"DOCENTE FRENTE A GRUPO",9957.3199999999979]
[null,"SAN LUIS POTOSI","24DPT0001U","MEAE5511093F3","MEAE551109HSPNBS06","EUSTOLIO MENDEZ ABAT",0,"PC",20,20130207,20130628,"DOCENTE FRENTE A GRUPO",23807.46]
[null,"SAN LUIS POTOSI","24DPT0001U","GAWE720429R46","GAWE720429MSPRLV00","EVA GARCIA WILLIAMS",0,"PA",19,20130207,20130628,"DOCENTE FRENTE A GRUPO",12418.18]
[null,"SAN LUIS POTOSI","24DPT0001U","RUAF651010QR4","RUAF651010MSPBLR05","FRANCISCA RUBIO ALMARAZ",0,"PA",20,20130207,20130628,"DOCENTE FRENTE A GRUPO",14903.91]
[null,"SAN LUIS POTOSI","24DPT0001U","MOVF710710888","MOVF710710HVZRLR00","FRANCISCO JAVIER MORALES VELAZQUEZ",0,"PC",20,20130207,20130628,"DOCENTE FRENTE A GRUPO",24067.269999999997]
[null,"SAN LUIS POTOSI","24DPT0001U","NAGF801230EGA","NAGF801230HDFVR06","FRANCISCO NAVARRO GUERRERO",0,"PA",18,20130207,20130628,"DOCENTE FRENTE A GRUPO",5019.45]
[null,"SAN LUIS POTOSI","24DPT0001U","SACG841214GZ3","SACG841214MTSLVB06","GABRIELA SALAZAR CAVAZOS",0,"PA",16,20130207,20130628,"DOCENTE FRENTE A GRUPO",4665.21]
[null,"SAN LUIS POTOSI","24DPT0001U","TEOG570214T8A","TEOG570214HSPRCR06","GERARDO VALENTIN TREVIÑO OCEJO",0,"PA",20,20130207,20130628,"DOCENTE FRENTE A GRUPO",19141.870000000003]
[null,"SAN LUIS POTOSI","24DPT0001U","HEGG780128EM4","HEGG780128MDFRNS09","GISELA BEATRIZ HERNANDEZ  GONZALEZ",2462524044,"PB",20,20130207,20130628,"DOCENTE FRENTE A GRUPO",65.599999999999994]
[null,"SAN LUIS POTOSI","24DPT0001U","HEGG780128EM4","HEGG780128MDFRNS09","GISELA BEATRIZ HERNANDEZ GONZALEZ",0,"PB",20,20130812,20130628,"DOCENTE FRENTE A GRUPO",9354.7100000000009]
[null,"SAN LUIS POTOSI","24DPT0001U","FOBG800614EZ4","FOBG800614MSPLRS06","GISELA FLORES BARRIENTOS",0,"PB",20,20130207,20130628,"DOCENTE FRENTE A GRUPO",9660.7000000000007]
[null,"SAN LUIS POTOSI","24DPT0001U","HEGG810522N96","HEGG810522MSPRRL02","GLORIA HILDA HERRERA GARCIA",0,"PA",18,20130207,20130628,"DOCENTE FRENTE A GRUPO",5102.71]
[null,"SAN LUIS POTOSI","24DPT0001U","CEJG7106259P4","CEJG710625HSPRML04","GUILLERMO CERVANTES JIMENEZ",0,"PC",20,20130207,20130628,"DOCENTE FRENTE A GRUPO",24028.390000000003]
[null,"SAN LUIS POTOSI","24DPT0001U","CAGH771105EK2","CAGH771105MSPSZY07","HAYDEE DE JESÚS CASTILLO GUZMAN",0,"PA",19,20130207,20130628,"DOCENTE FRENTE A GRUPO",2368.4]
[null,"SAN LUIS POTOSI","24DPT0001U","CAGH771105EK2","CAGH771105MSPSZY07","HAYDEE DE JESﾚS CASTILLO GUZMAN",0,"PA",19,20130207,20130628,"DOCENTE FRENTE A GRUPO",2563.71]
[null,"SAN LUIS POTOSI","24DPT0001U","GAOH7907028M8","GAOH790702HSPRRC04","HECTOR LUIS GARCIA  ORTEGA",0,"PB",20,20130207,20130628,"DOCENTE FRENTE A GRUPO",21614.95]
[null,"SAN LUIS POTOSI","24DPT0001U","MACI651102HW7","MACI651102MSPRSM05","IMELDA MARQUEZ CISNEROS",0,"PC",20,20130207,20130628,"DOCENTE FRENTE A GRUPO",21502.479999999996]
[null,"SAN LUIS POTOSI","24DPT0001U","MUMI6502099Y1","MUMI650209MPLXRR03","IRMA MUÑOZ MORALES",0,"PA",20,20130207,20130628,"DOCENTE FRENTE A GRUPO",13440.64]
[null,"SAN LUIS POTOSI","24DPT0001U","REAI680404G22","REAI680404MSPYGR02","IRMA REYES AGUILAR",0,"TA",20,20130207,20130628,"DOCENTE FRENTE A GRUPO",5498.6200000000008]
[null,"SAN LUIS POTOSI","24DPT0001U","GUMI730706SB1","GUMI730706HSPRNS01","ISAIAS GUERRERO MONZON",0,"PA",20,20130207,20130628,"DOCENTE FRENTE A GRUPO",16473.149999999998]
[null,"SAN LUIS POTOSI","24DPT0001U","GOHI7107157V2","GOHI710715MTSNRX03","IXCHEL GONZALEZ HERNANDEZ",0,"PC",20,20130207,20130628,"DOCENTE FRENTE A GRUPO",23986.059999999994]
[null,"SAN LUIS POTOSI","24DPT0001U","LIVJ720505VE3","LIVJ720505HTSMLR07","JORGE ALBERTO LIMON VILLANUEVA",0,"PB",20,20130207,20130628,"DOCENTE FRENTE A GRUPO",23246.780000000002]
[null,"SAN LUIS POTOSI","24DPT0001U","RUAJ780917EP9","RUAJ780917HSPBRN09","JUAN JESUS RUBIO ARTEAGA",0,"PB",20,20130207,20130628,"DOCENTE FRENTE A GRUPO",14734.830000000004]
[null,"SAN LUIS POTOSI","24DPT0001U","LOMJ711030F60","LOMJ711030HSPPYN03","JUAN MARTIN LOPEZ MAYORGA",0,"PB",20,20130207,20130628,"DOCENTE FRENTE A GRUPO",22646.080000000002]
[null,"SAN LUIS POTOSI","24DPT0001U","EAVJ7402025Q6","EAVJ740202HSPSRN00","JUAN PATRICIO ESCAMILLA VARGAS",0,"PC",20,20130207,20130628,"DOCENTE FRENTE A GRUPO",12576.01]
[null,"SAN LUIS POTOSI","24DPT0001U","COHJ580113A73","COHJ580113MMCRRN07","JUANA EVA CORDOVA HERNANDEZ",0,"PC",20,20130207,20130628,"DOCENTE FRENTE A GRUPO",23769.399999999994]
[null,"SAN LUIS POTOSI","24DPT0001U","VINJ740730LS5","VINJ740730MSPTYL00","JULIETA VITALES NOYOLA",0,"PB",20,20130207,20130628,"DOCENTE FRENTE A GRUPO",15494.23]
[null,"SAN LUIS POTOSI","24DPT0001U","MARJ770923516","MARJ770923HSPTML00","JULIO CESAR MATEOS ROMERO",0,"PC",20,20130207,20130628,"DOCENTE FRENTE A GRUPO",14549.43]
[null,"SAN LUIS POTOSI","24DPT0001U","GAAL650815RR2","GAAL650815MSPLMR09","LAURA GALLARDO DEL ANGEL",0,"PC",20,20130207,20130628,"DOCENTE FRENTE A GRUPO",22199.25]
[null,"SAN LUIS POTOSI","24DPT0001U","RURL781116QJ9","RURL781116MSPZJN07","LEONOR ORLEM RUIZ  ROJAS",0,"PB",20,20130207,20130628,"DOCENTE FRENTE A GRUPO",19328.27]
[null,"SAN LUIS POTOSI","24DPT0001U","GOFL680327B85","GOFL680327MSPNLT04","LETICIA GONZALEZ FLORES",0,"PC",20,20130207,20130628,"DOCENTE FRENTE A GRUPO",15009.39]
[null,"SAN LUIS POTOSI","24DPT0001U","GAHL630515KS3","GAHL630515MSPRRL02","LILIA GARCIA  HERNANDEZ",0,"PC",20,20130207,20130628,"DOCENTE FRENTE A GRUPO",8594.2099999999991]
[null,"SAN LUIS POTOSI","24DPT0001U","NAPL890330BAA","NAPL890330HSPVYS01","LUIS ERICK NAVARRO PAYTA",0,"PA",19,20130207,20130628,"DOCENTE FRENTE A GRUPO",5298.7199999999993]
[null,"SAN LUIS POTOSI","24DPT0001U","HENF580407SM5","HENF580407MTSRTT02","MA. DE FATIMA HERRERA NIETO",0,"PB",20,20130207,20130628,"DOCENTE FRENTE A GRUPO",15877.650000000001]
[null,"SAN LUIS POTOSI","24DPT0001U","AAEC701030QT9","AAEC701030MDFNSN09","MA. DEL CONSUELO ANASTACIO ESTEFES",0,"PB",20,20130207,20130628,"DOCENTE FRENTE A GRUPO",23233.439999999999]
[null,"SAN LUIS POTOSI","24DPT0001U","COCE520817DA6","COCE520817MSPRSL06","MA. ELENA CORDOVA CASTILLO",0,"PC",20,20130207,20130628,"DOCENTE FRENTE A GRUPO",13424.88]
[null,"SAN LUIS POTOSI","24DPT0001U","MOVG651124QZ2","MOVG651124MTSRZD06","MA. GUADALUPE MORALES VAZQUEZ",0,"PC",12,20130207,20130628,"DOCENTE FRENTE A GRUPO",16261.550000000001]
[null,"SAN LUIS POTOSI","24DPT0001U","COLL581114DC8","COLL581114MSPMPS09","MA. LUISA COMPEAN LOPEZ",0,"PC",20,20130207,20130628,"DOCENTE FRENTE A GRUPO",23705.579999999998]
[null,"SAN LUIS POTOSI","24DPT0001U","CUFM730703JL2","CUFM730703HSPNNR00","MARCO ANTONIO CUENDIA FUENTES",0,"PB",20,20130207,20130628,"DOCENTE FRENTE A GRUPO",15565.16]
[null,"SAN LUIS POTOSI","24DPT0001U","DERA630916TV7","DERA630916MSLLDL09","MARIA ALICIA DELGADO  RODRIGUEZ",0,"PC",20,20130207,20130628,"DOCENTE FRENTE A GRUPO",26485.459999999995]
[null,"SAN LUIS POTOSI","24DPT0001U","POLG541025AQ5","POLG541025MSPZRD06","MARIA GUADALUPE POZOS LARRAGA",0,"PC",20,20130207,20130628,"DOCENTE FRENTE A GRUPO",20196.969999999998]
[null,"SAN LUIS POTOSI","24DPT0001U","TORP620614DL8","TORP620614MTSRMT07","MARIA PATRICIA TORRES ROMERO",0,"PC",20,20130207,20130628,"DOCENTE FRENTE A GRUPO",16636.61]
[null,"SAN LUIS POTOSI","24DPT0001U","TOCM570613U68","TOCM570613MSPRRR08","MARICELA TORRES CRUZ",0,"PB",20,20130207,20130628,"DOCENTE FRENTE A GRUPO",15859.419999999998]
[null,"SAN LUIS POTOSI","24DPT0001U","CARM5007227Y1","CARM500722MSPMGR08","MARTHA EUGENIA CAMACHO  REGALADO",0,"PC",20,20130207,20130628,"DOCENTE FRENTE A GRUPO",24142.86]
[null,"SAN LUIS POTOSI","24DPT0001U","VAPM690514RM6","VAPM690514MSPRRR03","MIREYA VAZQUEZ PIZAÑO",0,"PC",20,20130207,20130628,"DOCENTE FRENTE A GRUPO",14133.229999999998]
[null,"SAN LUIS POTOSI","24DPT0001U","MUCE500527AZA","MUCE500527MSPNRS08","MUNGUIA CERVANTES ESTHER",0,0,20,20130812,99999999,"DOCENTE FRENTE A GRUPO",7375.7]
[null,"SAN LUIS POTOSI","24DPT0001U","IACN720128FT9","IACN720128MTSZRL07","NELLY ROSINA IZAGUIRRE CARDENAS",0,"PC",12,20130207,20130628,"DOCENTE FRENTE A GRUPO",17743.949999999997]
[null,"SAN LUIS POTOSI","24DPT0001U","ZAEN580910A82","ZAEN580910HSPMLC05","NICOLAS FLORENTINO ZAMORA ELENA",0,"PC",20,20130207,20130628,"DOCENTE FRENTE A GRUPO",12640.539999999999]
[null,"SAN LUIS POTOSI","24DPT0001U","REON6505273IA","REON650527MSPSLM06","NOEMI RESENDIZ OLVERA",0,"PA",8,20130207,20130628,"DOCENTE FRENTE A GRUPO",5864.14]
[null,"SAN LUIS POTOSI","24DPT0001U","GAWE720429","GAWE720429MSPRLV00","NOHEMI GONZALEZ CASTILLO",0,"PA",10,20130207,20130628,"DOCENTE FRENTE A GRUPO",2737.6]
[null,"SAN LUIS POTOSI","24DPT0001U","HEZN6209238G4","HEZN620923MTSRVR07","NORA ELVA HERNANDEZ  ZAVALA",0,"PB",20,20130207,20130628,"DOCENTE FRENTE A GRUPO",21433.14]
[null,"SAN LUIS POTOSI","24DPT0001U","MORN691121QC4","MORN691121MSPCMR06","NORMA MOCTEZUMA RAMIREZ",0,"PC",20,20130207,20130628,"DOCENTE FRENTE A GRUPO",17772.96]
[null,"SAN LUIS POTOSI","24DPT0001U","RAMP610701DI8","RAMP610701HMCMRB04","PABLO RAMIREZ MARTINEZ",0,"PA",20,20130207,20130628,"DOCENTE FRENTE A GRUPO",10808.989999999998]
[null,"SAN LUIS POTOSI","24DPT0001U","SAPP700212N85","SAPP700212HSPMND08","PEDRO SAMANO PONCE",0,"PB",20,20130207,20130628,"DOCENTE FRENTE A GRUPO",14826.220000000001]
[null,"SAN LUIS POTOSI","24DPT0001U","CAAP651030TB8","CAAP651030MSPSVT05","PETRA CASTILLO  AVILA",0,"PB",20,20130207,20130628,"DOCENTE FRENTE A GRUPO",8537.4700000000012]
[null,"SAN LUIS POTOSI","24DPT0001U","COMR481210UL6","COMR481210MSPVNY01","REYNA COVARRUBIAS MENDOZA",0,"PC",20,20130207,20130628,"DOCENTE FRENTE A GRUPO",17002.21]
[null,"SAN LUIS POTOSI","24DPT0001U","MURR701108HU7","MURR701108HSPXLG05","ROGELIO MUÑOZ RAMIREZ",0,"PC",20,20130207,20130628,"DOCENTE FRENTE A GRUPO",2871.579999999999]
[null,"SAN LUIS POTOSI","24DPT0001U","GUMR700301CP","GUMR700301MSPRNS09","ROSA MARIA GUERRERO MENDOZA",0,"PC",20,20130207,20130628,"DOCENTE FRENTE A GRUPO",24067.27]
[null,"SAN LUIS POTOSI","24DPT0001U","CAPR6201295A2","CAPR620129HSPMDB06","RUBEN CAMACHO PADRON",0,"PB",20,20130207,20130628,"DOCENTE FRENTE A GRUPO",12261.1]
[null,"SAN LUIS POTOSI","24DPT0001U","MAMS830804ME7","MAMS830804MSPRRN06","SANDRA CECILIA MARTINEZ MARTINEZ",0,"PA",17,20130207,20130628,"DOCENTE FRENTE A GRUPO",9287.0600000000013]
[null,"SAN LUIS POTOSI","24DPT0001U","TOMS6209162B5","TOMS620916MSPRCN03","SANDRA LUZ TORRES MOCTEZUMA",0,"PB",20,20130207,20130628,"DOCENTE FRENTE A GRUPO",19247.980000000003]
[null,"SAN LUIS POTOSI","24DPT0001U","BAMS641103QN1","BAMS641103MSPRNL09","SILVIA ELENA BARRIOS MENDOZA",0,"PC",20,20130207,20130628,"DOCENTE FRENTE A GRUPO",23519.73]
[null,"SAN LUIS POTOSI","24DPT0001U","MAGT910115E60","MAGT910115MSPRRH05","THANYA LIZZETH MARTINEZ GUERRERO",0,"TA",18,20130207,20130628,"DOCENTE FRENTE A GRUPO",11800.529999999999]
[null,"SAN LUIS POTOSI","24DPT0001U","IAAV7612233Z6","IAAV761223HSPZRC06","VICTOR MANUEL IZAGUIRRE ARELLANO",0,"PB",20,20130207,20130628,"DOCENTE FRENTE A GRUPO",21228.550000000003]
[null,"SAN LUIS POTOSI","24DPT0001U","BAXY600213Q39","BAXY600213MSPRXL06","YOLANDA BARRIOS ",0,"PC",20,20130207,20130628,"DOCENTE FRENTE A GRUPO",21338.92]
[null,"SAN LUIS POTOSI","24DPT0003S","AEMJ860512688","AEMJ860512HSPLDL07","ALEJO MEDINA JOEL EMMANUEL",0,"PA",16,20130701,20130715,"DOCENTE FRENTE A GRUPO",13257.269999999997]
[null,"SAN LUIS POTOSI","24DPT0003S","BIGC730914SF1","BIGC730914MSPRTR09","BRIONES GUTIERREZ CAROLINA DEL CARMEN",0,"PC",20,20130701,20130715,"DOCENTE FRENTE A GRUPO",25373.789999999997]
[null,"SAN LUIS POTOSI","24DPT0003S","CARH7709011FA","CARH770901HDFMYC01","CAMACHO REY HECTOR FELIPE",0,"PA",11,20130701,20130715,"DOCENTE FRENTE A GRUPO",9813.6700000000055]
[null,"SAN LUIS POTOSI","24DPT0003S","CAVS630617M45","CAVS630617MSPSLL08","CASTILLEJA VALADEZ SILVIA LEONOR",0,"PB",20,20130701,20130715,"DOCENTE FRENTE A GRUPO",21992.820000000007]
[null,"SAN LUIS POTOSI","24DPT0003S","CAOG7903238I0","CAOG790323HSPSRS18","CASTILLO ORTIZ GUSTAVO LEONEL",0,"PA",20,20130701,20130715,"DOCENTE FRENTE A GRUPO",21829.359999999997]
[null,"SAN LUIS POTOSI","24DPT0003S","CORJ781225526","CORJ781225MSPNTS08","CONTRERAS RETA JESSICA ELIZABETH",0,"PA",20,20130701,20130715,"DOCENTE FRENTE A GRUPO",19742.28999999999]
[null,"SAN LUIS POTOSI","24DPT0003S","EAMT6110155X2","EAMT611015MSPSRR06","ESTRADA MORALES TERESA DE JESUS",0,"PA",20,20130701,20130715,"DOCENTE FRENTE A GRUPO",14915.121620000002]
[null,"SAN LUIS POTOSI","24DPT0003S","GAMG8911159U0","GAMG891115HSPRDR02","GARAY MEDELLIN GERMAN",0,"PA",20,20130701,20130715,"DOCENTE FRENTE A GRUPO",5680.07]
[null,"SAN LUIS POTOSI","24DPT0003S","GASG740126UU3","GASG740126MSPRLD05","GARAY SILVA MARIA GUADALUPE",0,"PB",20,20130701,20130715,"DOCENTE FRENTE A GRUPO",20564.770000000008]
[null,"SAN LUIS POTOSI","24DPT0003S","GAOJ710130EIA","GAOJ710130HTSRRS06","GARZA ORTEGA JESUS ALBERTO",0,"PC",20,20130701,20130715,"DOCENTE FRENTE A GRUPO",20961.739760000008]
[null,"SAN LUIS POTOSI","24DPT0003S","GOTA72072926A","GOTA720729HSPNRB00","GONZALEZ TRISTAN ABEL ORLANDO",0,"PC",20,20130701,20130715,"DOCENTE FRENTE A GRUPO",28526.73]
[null,"SAN LUIS POTOSI","24DPT0003S","GOZF841127IC0","GOZF841127HSPNPR08","GONZALEZ ZAPATA FRANCISCO JAVIER",0,"PA",20,20130701,20130715,"DOCENTE FRENTE A GRUPO",17942.220000000008]
[null,"SAN LUIS POTOSI","24DPT0003S","HEGF671112HE5","HEGF671112HSPRNR08","HERNANDEZ GONZALEZ FRANCISCO",0,"PC",20,20130701,20130715,"DOCENTE FRENTE A GRUPO",18696.244400000011]
[null,"SAN LUIS POTOSI","24DPT0003S","HERA661026EM8","HERA661026HSPRYL02","HERNANDEZ REYNA ALEJANDRO",0,"PB",20,20130701,20130715,"DOCENTE FRENTE A GRUPO",23239.80000000001]
[null,"SAN LUIS POTOSI","24DPT0003S","HERE720801RM4","HERE720801MSPRYS05","HERNANDEZ REYNA MARIA ESPERANZA",0,"PC",20,20130701,20130715,"DOCENTE FRENTE A GRUPO",25372.900000000009]
[null,"SAN LUIS POTOSI","24DPT0003S","HETM840413SA8","HETM840413HSPRLS05","HERNANDEZ TELLO MOISES",0,"TA",20,20130701,20130715,"DOCENTE FRENTE A GRUPO",11813.601552000011]
[null,"SAN LUIS POTOSI","24DPT0003S","JIMF880612N96","JIMF880612HSPMLR02","JIMENEZ MALDONADO FRANCISCO ANTONIO",0,"PA",12,20130701,20130715,"DOCENTE FRENTE A GRUPO",8727.0300000000007]
[null,"SAN LUIS POTOSI","24DPT0003S","LOCJ6708117Q7","LOCJ670811HSPPHR01","LOPEZ CHAVEZ JORGE LUIS",0,"PA",20,20130701,20130715,"DOCENTE FRENTE A GRUPO",21297.739999999998]
[null,"SAN LUIS POTOSI","24DPT0003S","LOVL781118RQ2","LOVL781118HSPPLS07","LOPEZ VELEZ LUIS ANGEL",0,"TA",20,20130701,20130715,"DOCENTE FRENTE A GRUPO",13313.625520000011]
[null,"SAN LUIS POTOSI","24DPT0003S","LOOI630403PR0","LOOI630403HSPRBS07","LOREDO OBREGON ISRAEL",0,"PC",20,20130701,20130715,"DOCENTE FRENTE A GRUPO",19140.664000000001]
[null,"SAN LUIS POTOSI","24DPT0003S","MEMA921014HSP","MEMA921014HSPDDL09","MEDELLIN MEDRANO ALEJANDRO",0,"TA",18,20130701,20130715,"DOCENTE FRENTE A GRUPO",9153.6299999999992]
[null,"SAN LUIS POTOSI","24DPT0003S","MERA670804NV8","MERA670804HSPDNL04","MEDELLIN RANGEL ALEJO",0,"PC",20,20130701,20130715,"DOCENTE FRENTE A GRUPO",25357.009999999991]
[null,"SAN LUIS POTOSI","24DPT0003S","MUZF701029F18","MUZF701029HSPXPD07","MUÑOZ ZAPATA FEDERICO",0,"TA",20,20130716,20130731,"DOCENTE FRENTE A GRUPO",11605.352159999999]
[null,"SAN LUIS POTOSI","24DPT0003S","PARA7506234J1","PARA750623MSPRDL08","PARRA RUEDA ALMA ALICIA",0,"PA",9,20130701,20130715,"DOCENTE FRENTE A GRUPO",12210.6]
[null,"SAN LUIS POTOSI","24DPT0003S","PECR760307GI7","PECR760307MSPXRS06","PEÑA CAREAGA ROSALBA",0,"PC",6,20130716,20130731,"DOCENTE FRENTE A GRUPO",9132.9999999999982]
[null,"SAN LUIS POTOSI","24DPT0003S","PEEP890119HSP","PEEP890119HSPXSB05","PEÑA ESTRADA PABLO MIGUEL",0,"TA",10,20130716,20130731,"DOCENTE FRENTE A GRUPO",2355.98]
[null,"SAN LUIS POTOSI","24DPT0003S","RALI650814RIA","RALI650814HSPNRS08","RANGEL LOERA ISMAEL",0,"PC",20,20130701,20130715,"DOCENTE FRENTE A GRUPO",19344.559999999998]
[null,"SAN LUIS POTOSI","24DPT0003S","REAI771031CL0","REAI771031HSPYRS09","REYES ARZOLA ISAAC",0,"PA",20,20130701,20130715,"DOCENTE FRENTE A GRUPO",22020.12]
[null,"SAN LUIS POTOSI","24DPT0003S","REMY780416J54","REMY780416MCLYNM02","REYES MENDOZA MARIA YAMINA",0,"PA",20,20130701,20130715,"DOCENTE FRENTE A GRUPO",17413.22048]
[null,"SAN LUIS POTOSI","24DPT0003S","RECJ630208ND7","RECJ630208HSPYRV06","REYNA CARDENAS JUVENCIO",0,"PC",20,20130701,20130715,"DOCENTE FRENTE A GRUPO",20080.049999999988]
[null,"SAN LUIS POTOSI","24DPT0003S","ROGH6205024I0","ROGH620502HSPCTC06","ROCHA GAITAN HECTOR",0,"PC",20,20130701,20130715,"DOCENTE FRENTE A GRUPO",23131.520000000011]
[null,"SAN LUIS POTOSI","24DPT0003S","ROAR640809MVA","ROAR640809MSPDLM06","RODRIGUEZ ALVARADO ROMANA",0,"PC",20,20130701,20130715,"DOCENTE FRENTE A GRUPO",24419.950000000008]
[null,"SAN LUIS POTOSI","24DPT0003S","ROAT681015HRO","ROAT681015MSPDLR08","RODRIGUEZ ALVISO TERESA DE JESUS",0,"PC",20,20130701,20130715,"DOCENTE FRENTE A GRUPO",25186.020000000011]
[null,"SAN LUIS POTOSI","24DPT0003S","ROBA710121429","ROBA710121MSPDRL09","RODRIGUEZ BARRON ALMA ROSA",0,"PC",20,20130701,20130715,"DOCENTE FRENTE A GRUPO",25011.490000000009]
[null,"SAN LUIS POTOSI","24DPT0003S","ROCE701105KU1","ROCE701105MSPDRL08","RODRIGUEZ CERDA ELSA",0,"PC",20,20130701,20130715,"DOCENTE FRENTE A GRUPO",25695.639999999996]
[null,"SAN LUIS POTOSI","24DPT0003S","ROGG670204618","ROGG670204HSPDRL07","RODRIGUEZ GARCIA GILBERTO",0,"PB",20,20130701,20130715,"DOCENTE FRENTE A GRUPO",22027.190000000021]
[null,"SAN LUIS POTOSI","24DPT0003S","RUCH5602237U6","RUCH560223HSPDRC07","RUEDA CARMONA HECTOR MANUEL",0,"PC",20,20130701,20130715,"DOCENTE FRENTE A GRUPO",18699.829999999991]
[null,"SAN LUIS POTOSI","24DPT0003S","SAEC841019T26","SAEC841019MTLLSL01","SALAZAR ESPINOSA CLAUDIA NATIVIDAD",0,"PA",18,20130701,20130715,"DOCENTE FRENTE A GRUPO",11342.8]
[null,"SAN LUIS POTOSI","24DPT0003S","SARM630502EA7","SARM630502HSPNNR08","SANDOVAL RANGEL MARTIN",0,"PA",20,20130701,20130715,"DOCENTE FRENTE A GRUPO",20499.169999999998]
[null,"SAN LUIS POTOSI","24DPT0003S","TOEX860325JN8","TOEX860325MSPRSC06","TORRES ESTRADA XOCHITL ARMANDINA",0,"PA",15,20130701,20130715,"DOCENTE FRENTE A GRUPO",4183.05]
[null,"SAN LUIS POTOSI","24DPT0003S","TOFR8004283Q6","TOFR800428MSPRCB01","TORRES FACUNDO MARIA REBECA",0,"PB",20,20130701,20130715,"DOCENTE FRENTE A GRUPO",9371.9455080000007]
[null,"SAN LUIS POTOSI","24DPT0003S","TONS750716RT0","TONS750716MCLRVL01","TORRES NAVA SILVIA ELIZABETH",0,"PC",20,20130701,20130715,"DOCENTE FRENTE A GRUPO",18289.662879999996]
[null,"SAN LUIS POTOSI","24DPT0003S","VILC750206FG0","VILC750206MSPLLR05","VILLANUEVA LLANAS MARIA DEL CARMEN",0,"PA",20,20130701,20130715,"DOCENTE FRENTE A GRUPO",17657.71]
[null,"SAN LUIS POTOSI","24DPT0003S","ZARE810108KA9","ZARE810108MSPMDL06","ZAMORA RODRIGUEZ ELISA ",0,"PA",12,20130701,20130715,"DOCENTE FRENTE A GRUPO",6488.23]
[null,"SAN LUIS POTOSI","24DPT0005Q","PEAA520909BV4","PEAA520909HSPRRL08","ALFREDO PEREZ ARAUJO",0,"PB",20,20070501,20131231,"DOCENTE FRENTE A GRUPO",13954.7266]
[null,"SAN LUIS POTOSI","24DPT0005Q","MAMA610628PT8","MAMA610628MSPRXL03","ALICIA MARTINEZ MUÑOZ",0,"PC",20,20070501,20131231,"DOCENTE FRENTE A GRUPO",12698.091035999998]
[null,"SAN LUIS POTOSI","24DPT0005Q","MAAA780120V62","MAAA780120MSPRNL01","ALMA GEORGINA MARTIN DEL CAMPO DE ANDA",0,"PC",20,20070501,20131231,"DOCENTE FRENTE A GRUPO",24521.670000000002]
[null,"SAN LUIS POTOSI","24DPT0005Q","PELA710227AF5","PELA710227HSPRRN06","ANTONIO ALEJANDRO PEREZ  LOREDO",0,"PC",20,20070501,20131231,"DOCENTE FRENTE A GRUPO",21981.299999999985]
[null,"SAN LUIS POTOSI","24DPT0005Q","MAVA580913UN9","MAVA580913HSPRGN04","ANTONIO MARTINEZ VEGA",0,"PC",20,20070501,20131231,"DOCENTE FRENTE A GRUPO",21061.119999999999]
[null,"SAN LUIS POTOSI","24DPT0005Q","MACA571230PH6","MACA571230HSPRRP02","APOLINAR MARTINEZ CRUZ",0,"PC",20,20070501,20131231,"DOCENTE FRENTE A GRUPO",25294.789999999997]
[null,"SAN LUIS POTOSI","24DPT0005Q","CAGA681224DN5","CXGA681224HSPBLR04","ARTURO CABRERA GALVAN ",0,"PB",20,20070501,20131231,"DOCENTE FRENTE A GRUPO",21621.85]
[null,"SAN LUIS POTOSI","24DPT0005Q","EADC731211D","EADC731211MSPSQL09","CLARA EMILIA ESPARZA DUQUE",0,"PB",20,20070501,20131231,"DOCENTE FRENTE A GRUPO",17636.511880000002]
[null,"SAN LUIS POTOSI","24DPT0005Q","MOCC7211273F5","MOCC721127MGTNRN03","CONCEPCION CATALINA MONASTERIO CRUZ",0,"PA",20,20091202,20131231,"DOCENTE FRENTE A GRUPO",15935.45592]
[null,"SAN LUIS POTOSI","24DPT0005Q","SAHD750908E51","SAHD750908HSPNRV09","DAVID ANGEL SANCHEZ HERNANDEZ",0,"PC",20,20070501,20131231,"DOCENTE FRENTE A GRUPO",16591.6672]
[null,"SAN LUIS POTOSI","24DPT0005Q","ZATE831201JU2","ZATE831201HSPVRR07","ERIC ZAVALIJA TORRES",0,"PA",12,20130522,20131231,"DOCENTE FRENTE A GRUPO",1994.0900000000001]
[null,"SAN LUIS POTOSI","24DPT0005Q","MEMF650811L66","MEMF650811HSPNRL08","FELIPE MENDEZ MORENO",0,"PC",20,20070501,20131231,"DOCENTE FRENTE A GRUPO",15816.461999999998]
[null,"SAN LUIS POTOSI","24DPT0005Q","GOGG5603254M4","GOGG560325HSPNNB00","GABRIEL GONZALEZ GONZALEZ",0,"PC",20,20070501,20131231,"DOCENTE FRENTE A GRUPO",18480.245599999987]
[null,"SAN LUIS POTOSI","24DPT0005Q","AAMG750317V44","AAMG750317MSPNDB04","GABRIELA ANDRADE MEDINA",0,"PA",20,20070501,20131231,"DOCENTE FRENTE A GRUPO",19962.88]
[null,"SAN LUIS POTOSI","24DPT0005Q","ROCG640621IX7","ROCG640621HSPCRL08","GUILLERMO LUIS ROCHA CERDA",0,"PB",20,20070501,20131231,"DOCENTE FRENTE A GRUPO",12947.955600000001]
[null,"SAN LUIS POTOSI","24DPT0005Q","TUAG691023FZ5","TUAG691023HSPRRS09","GUSTAVO TURRUBIARTES ARMENDARIZ",0,"PA",10,20130207,20131231,"DOCENTE FRENTE A GRUPO",13188.8]
[null,"SAN LUIS POTOSI","24DPT0005Q","AAAH620408J7A","AAAH620408HSPLGC09","HECTOR ALVARADO AGUILAR",0,"PC",20,20070501,20131231,"DOCENTE FRENTE A GRUPO",25935.71]
[null,"SAN LUIS POTOSI","24DPT0005Q","NICH500406FIA","NICH500406HOCCRC04","HECTOR NICOLAS CRUZ",0,"PC",20,20070501,20131231,"DOCENTE FRENTE A GRUPO",26036.83]
[null,"SAN LUIS POTOSI","24DPT0005Q","GAGH690109G27","GAGH690109HTSTRR02","HERNANDO GAITAN  GARCIA",0,"PC",20,20070501,20131231,"DOCENTE FRENTE A GRUPO",26039.1]
[null,"SAN LUIS POTOSI","24DPT0005Q","OONI7406107B6","OONI740610MSPRRS07","ISABEL OROZCO NARVAEZ",0,"PC",20,20070501,20131231,"DOCENTE FRENTE A GRUPO",16139.204900000008]
[null,"SAN LUIS POTOSI","24DPT0005Q","MASJ701225MPA","MASJ701225MSPRNC05","JACQUELINE MARQUEZ SANCHEZ",0,"PC",20,20070501,20131231,"DOCENTE FRENTE A GRUPO",12536.569199999989]
[null,"SAN LUIS POTOSI","24DPT0005Q","ROGJ611105BLA","ROGJ611005HSPCVV07","JAVIER ROCHA GUEVARA",0,"PC",20,20070501,20131231,"DOCENTE FRENTE A GRUPO",26425.249999999993]
[null,"SAN LUIS POTOSI","24DPT0005Q","ROAJ780411149","ROAJ780411HSPDVV15","JAVIER VLADIMIR RODRIGUEZ  AVALOS",0,"PA",20,20070501,20131231,"DOCENTE FRENTE A GRUPO",17184.419999999998]
[null,"SAN LUIS POTOSI","24DPT0005Q","BIBJ740611411","BIBJ740611MDFRCR01","JERITZIA BRIONES BECERRIL",0,"PC",20,20070501,20131231,"DOCENTE FRENTE A GRUPO",22712.629999999997]
[null,"SAN LUIS POTOSI","24DPT0005Q","RASJ510626SU0","RASJ510626HSPMLS08","JESUS RAMIREZ SALDAÑA",0,"PA",20,20070501,20131231,"DOCENTE FRENTE A GRUPO",15138.559999999998]
[null,"SAN LUIS POTOSI","24DPT0005Q","JADJ611209J81","JADJ611209HSPSZL06","JOEL JASSO DIAZ DE LEON",0,"PC",20,20070501,20131231,"DOCENTE FRENTE A GRUPO",23233.999999999996]
[null,"SAN LUIS POTOSI","24DPT0005Q","GAHJ5112239S7","GAHJ511223HDFRRR08","JORGE GARCIA  HUERTA",0,"PB",20,20070501,20131231,"DOCENTE FRENTE A GRUPO",22775.510000000002]
[null,"SAN LUIS POTOSI","24DPT0005Q","RESA7310259T4","RESA731025HSPYRN09","JOSE ANTONIO REYES SORIA",0,"PA",5,20070501,20131231,"DOCENTE FRENTE A GRUPO",6815.18]
[null,"SAN LUIS POTOSI","24DPT0005Q","MAGC760229LNA","MAGC760229HSPRLR06","JOSE CIRILO MARTINEZ GUEL",0,"PA",11,20070501,20131231,"DOCENTE FRENTE A GRUPO",16673.179999999997]
[null,"SAN LUIS POTOSI","24DPT0005Q","GAMJ740817IB0  ","GAMJ740817HSPRXS06","JOSE DE JESUS GARCIA  MUÑIZ",0,"PC",20,20070501,20131231,"DOCENTE FRENTE A GRUPO",25309.689999999988]
[null,"SAN LUIS POTOSI","24DPT0005Q","CARL4406129D4","CARL440612HSPNDS00","JOSE DE JESUS L. CANDELARIA RODRIGUEZ ",0,"PC",20,20070501,20131231,"DOCENTE FRENTE A GRUPO",24470.01]
[null,"SAN LUIS POTOSI","24DPT0005Q","MOMJ8212233P","MOMJ821223HSPTRS09","JOSE DE JESUS MOTA MARTINEZ",0,"TA",20,20130207,20131231,"DOCENTE FRENTE A GRUPO",8728.27]
[null,"SAN LUIS POTOSI","24DPT0005Q","MAHL760517HSP","MAHL760517HSPRRZ08","JOSE DE LA LUZ MARTINEZ HERNANDEZ",0,"PA",20,20070501,20131231,"DOCENTE FRENTE A GRUPO",20176.54]
[null,"SAN LUIS POTOSI","24DPT0005Q","BAME661107RG9","BAME661107HSPLCR00","JOSE ERNESTO BALDERAS MOCTEZUMA",0,"PA",20,20070501,20131231,"DOCENTE FRENTE A GRUPO",21415.219999999998]
[null,"SAN LUIS POTOSI","24DPT0005Q","GOMJ610824C57","GOMJ610824HSPNRS00","JOSE GONZALEZ MARQUEZ",0,"PC",20,20070501,20131231,"DOCENTE FRENTE A GRUPO",26056.429999999997]
[null,"SAN LUIS POTOSI","24DPT0005Q","OOSL700110939","OOSL700110HSPLLS06","JOSE LUIS OLMOS SALINAS",0,"PC",20,20070501,20131231,"DOCENTE FRENTE A GRUPO",24302.589999999993]
[null,"SAN LUIS POTOSI","24DPT0005Q","ZAEL5605308Z2","ZAEL560530HSPPSS02","JOSE LUIS ZAPATA ESQUIVEL",0,"PB",20,20070501,20131231,"DOCENTE FRENTE A GRUPO",22028.07]
[null,"SAN LUIS POTOSI","24DPT0005Q","GUMR6108145QI","GUMR610814HSPRXM05","JOSE RAMON GUERRERO  MUÑOZ",0,"PA",20,20070501,20131231,"DOCENTE FRENTE A GRUPO",7570.8739999999998]
[null,"SAN LUIS POTOSI","24DPT0005Q","FAMR5611097XA","FAMR561109HSPZLY02","JOSE REYNALDO FAZ MELENDEZ",0,"PB",20,20070501,20131231,"DOCENTE FRENTE A GRUPO",19104.670000000002]
[null,"SAN LUIS POTOSI","24DPT0005Q","GURJ631108BU2","GURJ631108HSPRYN00","JUAN ANTONIO GUERRERO  REYNA",0,"PB",20,20070501,20131231,"DOCENTE FRENTE A GRUPO",23920.42]
[null,"SAN LUIS POTOSI","24DPT0005Q","MUGJ740814TR0","MUGJ470814HDFXNN07","JUAN JESUS MUÑOZ GONZALEZ",0,"PB",20,20070501,20131231,"DOCENTE FRENTE A GRUPO",22504.48]
[null,"SAN LUIS POTOSI","24DPT0005Q","CEPJ6204099P","CEPJ620409HDFDNN07","JUAN MANUEL CEDILLO PONCE",0,"PA",20,20070501,20131231,"DOCENTE FRENTE A GRUPO",3016.016032]
[null,"SAN LUIS POTOSI","24DPT0005Q","REAJ550308GR7","REAJ550308HMCYLN03","JUAN REYES  ALANIS",0,"PC",20,20070501,20131231,"DOCENTE FRENTE A GRUPO",25052.57]
[null,"SAN LUIS POTOSI","24DPT0005Q","AEGJ710415S84","AEGJ710415HSPLML00","JULIO ALMENDAREZ GOMEZ",0,"PC",20,20070501,20131231,"DOCENTE FRENTE A GRUPO",18549.322599999996]
[null,"SAN LUIS POTOSI","24DPT0005Q","SAML701004NU0","SAML701004MSPLRR09","LAURA GEORGINA SALAS MART1NEZ",0,"PC",20,20070501,20131231,"DOCENTE FRENTE A GRUPO",25796.879999999997]
[null,"SAN LUIS POTOSI","24DPT0005Q","CAML790315LT5","CALM790315MSPRLR01","LAURA GRISELDA CARLOS MELCHOR",0,"PB",12,20070501,20131231,"DOCENTE FRENTE A GRUPO",15436.869999999999]
[null,"SAN LUIS POTOSI","24DPT0005Q","CEAL770411QU7","CEAL770411MSPRLR06","LORENA CERVANTES  ALMENDAREZ",0,"PB",20,20070501,20131231,"DOCENTE FRENTE A GRUPO",22594.800000000003]
[null,"SAN LUIS POTOSI","24DPT0005Q","GUNG7012058H2","GUNG701205MSPRYD06","MA. GUADALUPE GUERRERO  NOYOLA",0,"PC",20,20070501,20131231,"DOCENTE FRENTE A GRUPO",24524.53999999999]
[null,"SAN LUIS POTOSI","24DPT0005Q","MEDA710331LD8","MEDA710331MSPLZR07","MARIA ARACELI MELCHOR DIAZ DE LEON",0,"PC",20,20070501,20131231,"DOCENTE FRENTE A GRUPO",11969.720000000001]
[null,"SAN LUIS POTOSI","24DPT0005Q","VILR551117J86","VILR551117MSPLNS02","MARIA DEL ROSARIO VILLA DE LEON",0,"PC",20,20070501,20131231,"DOCENTE FRENTE A GRUPO",25643.549999999996]
[null,"SAN LUIS POTOSI","24DPT0005Q","LASE7210152Z4","LASE721015MSPRLL05","MARIA ELIZABETH LARA SALAZAR",0,"PC",20,20070501,20131231,"DOCENTE FRENTE A GRUPO",26314.419999999984]
[null,"SAN LUIS POTOSI","24DPT0005Q","MOHE770612FA9","MOHE770612MSPNRM06","MARIA EMILIA MONREAL HERNANDEZ",0,"PB",20,20070501,20131231,"DOCENTE FRENTE A GRUPO",14029.229200000002]
[null,"SAN LUIS POTOSI","24DPT0005Q","VEGE630912DG6","VEGE630912MSPGRM06","MARIA ESTELA VEGA GUERRERO",0,"PC",20,20070501,20131231,"DOCENTE FRENTE A GRUPO",24951.929399999997]
[null,"SAN LUIS POTOSI","24DPT0005Q","LEGV7511103D7","LEGV751110MSPJMC08","MARIA VICTORIA LEIJA GAMEZ",0,"PC",20,20070501,20131231,"DOCENTE FRENTE A GRUPO",18134.269199999995]
[null,"SAN LUIS POTOSI","24DPT0005Q","HEMM741229CT4","HEMM741229MSPRTR00","MARICELA HERNANDEZ MATA",0,"PC",20,20070501,20131231,"DOCENTE FRENTE A GRUPO",23997.839999999989]
[null,"SAN LUIS POTOSI","24DPT0005Q","EACM730411FGA","EACM730411MSPSRR00","MARISELA ESPARZA CERDA",0,"PC",20,20070501,20131231,"DOCENTE FRENTE A GRUPO",15632.997519999999]
[null,"SAN LUIS POTOSI","24DPT0005Q","AOMM570312AV4","AOMM570312MSPLDR05","MARTHA ALONSO MEDELLIN",0,"PC",20,20070501,20131231,"DOCENTE FRENTE A GRUPO",16880.599399999999]
[null,"SAN LUIS POTOSI","24DPT0005Q","TOSM760208363","TOSM760802HSPRLG04","MIGUEL TORRES SALDAÑA",0,"PB",20,20070501,20131231,"DOCENTE FRENTE A GRUPO",22608.519999999997]
[null,"SAN LUIS POTOSI","24DPT0005Q","MAMN741116431","MAMN741116MSPRNL00","NELY MARTINEZ MENDEZ",0,"PC",20,20070501,20131231,"DOCENTE FRENTE A GRUPO",23100.82]
[null,"SAN LUIS POTOSI","24DPT0005Q","GUMO6906207Z5","GUMO690620MNLRRL03","OLGA  GUERRERO  MORENO",0,"PA",20,20100208,20131231,"DOCENTE FRENTE A GRUPO",18361.66]
[null,"SAN LUIS POTOSI","24DPT0005Q","SITO710826RY5","SITO710826MSPLPL07","OLGA LIDIA SILVA TAPIA",0,"PC",20,20070501,20131231,"DOCENTE FRENTE A GRUPO",15244.387199999999]
[null,"SAN LUIS POTOSI","24DPT0005Q","CUAO5611296R8","CUAO561129HSPRLS04","OSCAR  CRUZ ALVARADO",0,"PA",20,20100208,20131231,"DOCENTE FRENTE A GRUPO",21582.6]
[null,"SAN LUIS POTOSI","24DPT0005Q","ZAMO781007TN8","ZAMO781007HTSVRS09","OSCAR IGNACIO ZAVALA MARTINEZ",0,"PA",20,20070501,20131231,"DOCENTE FRENTE A GRUPO",20449.059999999998]
[null,"SAN LUIS POTOSI","24DPT0005Q","MADP601115KJ2","MADP601115HSPRVB08","PABLO ALBERTO MARTINEZ  DAVILA",0,"PC",20,20070501,20131231,"DOCENTE FRENTE A GRUPO",25538.619999999988]
[null,"SAN LUIS POTOSI","24DPT0005Q","COJP580618DF1","COJP580618HSPRRB03","PABLO CORPUS JUAREZ",0,"PB",20,20070501,20131231,"DOCENTE FRENTE A GRUPO",23398.05]
[null,"SAN LUIS POTOSI","24DPT0005Q","HILR550718H26","HILR550718HSPDPY09","REYNALDO HIDALGO LOPEZ",0,"PC",20,20070501,20131231,"DOCENTE FRENTE A GRUPO",25570.289999999994]
[null,"SAN LUIS POTOSI","24DPT0005Q","DETR550304SL3","DETR550304HSPBPB07","ROBERTO DEBO  TAPIA",0,"PC",20,20070501,20131231,"DOCENTE FRENTE A GRUPO",24988.28]
[null,"SAN LUIS POTOSI","24DPT0005Q","GALR720507BR2","GALR720507HSPLPB07","ROBERTO GALARZA LOPEZ",0,"PC",20,20070501,20131231,"DOCENTE FRENTE A GRUPO",17030.219999999998]
[null,"SAN LUIS POTOSI","24DPT0005Q","HEHR531031IA9","HEHR531031HTSRRB09","ROBERTO HERNANDEZ HERNANDEZ",0,"PC",16,20130801,20131231,"DOCENTE FRENTE A GRUPO",12813.52]
[null,"SAN LUIS POTOSI","24DPT0005Q","OIOR520826S36","OIOR520826HSPNLB09","ROBERTO ONTIVEROS  OLVERA",0,"PC",20,20070501,20131231,"DOCENTE FRENTE A GRUPO",22572.18]
[null,"SAN LUIS POTOSI","24DPT0005Q","ZAER65101664A","ZAER651016MSPPSS05","ROSALVA ZAPATA ESQUIVEL",0,"PB",15,20070501,20131231,"DOCENTE FRENTE A GRUPO",15772.23977]
[null,"SAN LUIS POTOSI","24DPT0005Q","ROHR550913UA8","ROHR550913HSPCRB08","RUBEN ROCHA HERNANDEZ",0,"PC",20,20070501,20131231,"DOCENTE FRENTE A GRUPO",23956.909999999996]
[null,"SAN LUIS POTOSI","24DPT0005Q","EAMS530908K58","EAMS530908HSPSNR05","SERGIO ESCALANTE MONREAL",0,"PC",20,20070501,20131231,"DOCENTE FRENTE A GRUPO",24987.38]
[null,"SAN LUIS POTOSI","24DPT0005Q","MEBS710610EM4","MEBS710610MSPNRL03","SILVIA MANUELA MENDEZ BRISEÑO",0,"PA",12,20070501,20131231,"DOCENTE FRENTE A GRUPO",13340.899999999998]
[null,"SAN LUIS POTOSI","24DPT0005Q","FAGS780307E56","FAGS780307MSPCRS07","SUSANA FACUNDO GARCIA",0,"PA",20,20101019,20131231,"DOCENTE FRENTE A GRUPO",21600.530000000002]
[null,"SAN LUIS POTOSI","24DPT0005Q","SOAT6101048K8","SOAT610104HVZSNM18","TOMAS SOSA DEL ANGEL",0,"PC",20,20070501,20131231,"DOCENTE FRENTE A GRUPO",5399.4699999999993]
[null,"SAN LUIS POTOSI","24DPT0005Q","HUHV741223MX5","HUHV741223HSPRRC01","VICTOR MANUEL HURTADO HERNANDEZ",0,"PA",20,20070501,20131231,"DOCENTE FRENTE A GRUPO",16279.359999999999]
[null,"SAN LUIS POTOSI","24DPT0005Q","CAFV721223IG8","CAFV721223MSPMLC04","VICTORIA CAMPOS FLORES",0,"PC",20,20070501,20131231,"DOCENTE FRENTE A GRUPO",24935.119999999988]
[null,"SAN LUIS POTOSI","24DPT0005Q","RIHV8302182D","RIGV830218MSPSNR03","VIRGINIA RIOS GONZALEZ",0,"PA",20,20100208,20131231,"DOCENTE FRENTE A GRUPO",21514.84]
[null,"SAN LUIS POTOSI","24DPT0007O","AURW7711233I3","AURW771123MSPGYN07","AGUILAR REYES WENDY GUADALUPE",0,"PC",20,20070501,20131231,"DOCENTE FRENTE A GRUPO",20252.189999999999]
[null,"SAN LUIS POTOSI","24DPT0007O","AACL421108AB7","AACL421108HSPLBN03","ALANIS CABRERA LENIN ARNULFO",0,"PC",20,20070501,20131231,"DOCENTE FRENTE A GRUPO",24521.55]
[null,"SAN LUIS POTOSI","24DPT0007O","AACC6407247EA","AACC640724HSPRNT02","ARANDA CONTRERAS CUITLAHUAC",0,"PA",20,20130812,20131231,"DOCENTE FRENTE A GRUPO",18558.18]
[null,"SAN LUIS POTOSI","24DPT0007O","CEAS560904313","CEAS560904HCMRVN09","CERNAS AVALOS SANTIAGO",0,"PB",20,20070501,20131231,"DOCENTE FRENTE A GRUPO",22504.670000000002]
[null,"SAN LUIS POTOSI","24DPT0007O","CORD851103291","CORD851103MSPRMF01","CORPUS RAMIREZ DAFNE SILVANA",0,"PB",18,20130812,20131231,"DOCENTE FRENTE A GRUPO",13682.599999999997]
[null,"SAN LUIS POTOSI","24DPT0007O","COCR820311651","COCR820311HSPRNC04","CORTEZ CONTRERAS RICARDO ROLANDO",0,"PA",20,20100208,20131231,"DOCENTE FRENTE A GRUPO",18786.777999999998]
[null,"SAN LUIS POTOSI","24DPT0007O","CURJ7011068Y1","CURJ701106HSPRVV00","CRUZ RIVERA JAVIER LEONARDO",0,"PA",20,20070501,20131231,"DOCENTE FRENTE A GRUPO",15459.96]
[null,"SAN LUIS POTOSI","24DPT0007O","CUHA760315EI9","CUHA760315HSPLRN00","CUELLAR HUERTA JOSE ANTONIO",0,"PC",10,20070501,20131231,"DOCENTE FRENTE A GRUPO",12216.710000000001]
[null,"SAN LUIS POTOSI","24DPT0007O","DAPM8512312R5","DAPM851231HSPVZR07","DAVALOS PAEZ MARCO ANTONIO",0,"PA",18,20130812,20131231,"DOCENTE FRENTE A GRUPO",15820.24]
[null,"SAN LUIS POTOSI","24DPT0007O","EALM760403GUA","EALM760403HZSSYN09","ESPARZA LEYVA JOSE MANUEL",0,"PA",20,20070501,20131231,"DOCENTE FRENTE A GRUPO",21287.440000000002]
[null,"SAN LUIS POTOSI","24DPT0007O","FOHL830720SP9","FOHL830720HSPLRS01","FLORES HERNANDEZ LUIS ENRIQUE",0,"PA",20,20130812,20131231,"DOCENTE FRENTE A GRUPO",18494.77]
[null,"SAN LUIS POTOSI","24DPT0007O","FOHM790707DH8","FOHM790707MSPLRN07","FLORES HERNANDEZ MONICA JAZMIN",0,"PA",20,20070501,20131231,"DOCENTE FRENTE A GRUPO",19976.249999999996]
[null,"SAN LUIS POTOSI","24DPT0007O","GAME760915HS9","GAME760915MSPLDN02","GALLARDO MEDINA EMMA NOELIA",0,"PC",20,20130812,20131231,"DOCENTE FRENTE A GRUPO",6619.8600000000015]
[null,"SAN LUIS POTOSI","24DPT0007O","GAEG850702RC1","GAEG850702MSPYSV04","GAYTAN ESQUIVEL GIOVANNA DENNISE",0,"PA",20,20130812,20131231,"DOCENTE FRENTE A GRUPO",17607.53]
[null,"SAN LUIS POTOSI","24DPT0007O","GOCE870717B66","GOCE870717MSPNSR02","GONZALEZ CISNEROS ERIKA DEYADIRA",0,"PA",15,20130812,20131231,"DOCENTE FRENTE A GRUPO",15538.820000000002]
[null,"SAN LUIS POTOSI","24DPT0007O","GODK860424TX9","GODK860424MSPNZR01","GONZALEZ DIAZ KARLA BEATRIZ",0,"PA",20,20130812,20131231,"DOCENTE FRENTE A GRUPO",17253.909999999996]
[null,"SAN LUIS POTOSI","24DPT0007O","GOGM750520AD8","GOGM750520HSPNRR07","GONZALEZ GUERRA MARCO TULIO",0,"PA",20,20070501,20131231,"DOCENTE FRENTE A GRUPO",21760.69]
[null,"SAN LUIS POTOSI","24DPT0007O","GUDO5512047FO","GUDO551204MTSRZT03","GUERRA DIAZ OTILIA ELIZABETH",0,"PC",20,20070501,20131231,"DOCENTE FRENTE A GRUPO",25233.559999999998]
[null,"SAN LUIS POTOSI","24DPT0007O","HECA810404QG4","HECA810404HSPRBL07","HERNANDEZ CABRERA ALAIN ALBERTO",0,"PC",0,20070501,20131231,"DOCENTE FRENTE A GRUPO",0]
[null,"SAN LUIS POTOSI","24DPT0007O","JAAA7312072T4","JAAA731207HSPCCM05","JACOBO ACEVEDO AMBROSIO",0,"PA",20,20070501,20131231,"DOCENTE FRENTE A GRUPO",18362.189999999999]
[null,"SAN LUIS POTOSI","24DPT0007O","JACA790718KPA","JACA790718MSPCRN06","JACOBO CORONADO ANA MIRIAM",0,"PA",20,20130812,20131231,"DOCENTE FRENTE A GRUPO",17524.91]
[null,"SAN LUIS POTOSI","24DPT0007O","LEGA500601HSP","LEGA500601HSPZRL09","LEZAMA GARCIA ALFONSO",0,"PA",8,20130812,20131231,"DOCENTE FRENTE A GRUPO",7602.78]
[null,"SAN LUIS POTOSI","24DPT0007O","LOAJ8607033W0","LOAJ860703HSPPVN06","LOPEZ AVILA JUAN DAVID",0,"PA",20,20130812,20131231,"DOCENTE FRENTE A GRUPO",14471.880000000001]
[null,"SAN LUIS POTOSI","24DPT0007O","LOCR5807107Q5","LOCR580710HSPPSF08","LOPEZ CASTILLO RAFAEL",0,"PB",20,20070501,20131231,"DOCENTE FRENTE A GRUPO",21869.98]
[null,"SAN LUIS POTOSI","24DPT0007O","MALE770614155","MALE770614MPLRPL14","MARTINEZ LOPEZ ELIZABETH ANDRIKA",0,"PA",18,20130218,20131231,"DOCENTE FRENTE A GRUPO",2223.09]
[null,"SAN LUIS POTOSI","24DPT0007O","MALR751018G42","MALR751018MPLRPQ02","MARTINEZ LOPEZ RAQUEL",0,"PA",19,20130812,20131231,"DOCENTE FRENTE A GRUPO",8099.329999999999]
[null,"SAN LUIS POTOSI","24DPT0007O","MARS590126IL8","MARS590126MSPROL09","MARTINEZ RODRIGUEZ SILVIA",0,"PA",20,20070807,20131231,"DOCENTE FRENTE A GRUPO",19732.13]
[null,"SAN LUIS POTOSI","24DPT0007O","MATJ820624PE6","MATJ820624HSPRRN11","MARTINEZ TORRES JUAN MANUEL",0,"PA",20,20090509,20131231,"DOCENTE FRENTE A GRUPO",19599.489999999998]
[null,"SAN LUIS POTOSI","24DPT0007O","MEMM7906135N1","MEMM790613HSPLRN13","MELCHOR MORENO JOSE MANUEL",0,"PB",20,20070501,20131231,"DOCENTE FRENTE A GRUPO",15076.99]
[null,"SAN LUIS POTOSI","24DPT0007O","MEPH760604A24","MEPH760604HDFNRC07","MENDOZA PEREZ HECTOR ALEJANDRO",0,"PA",20,20100208,20131231,"DOCENTE FRENTE A GRUPO",21481.38]
[null,"SAN LUIS POTOSI","24DPT0007O","MEPJ741216UT6","MEPJ741216HDFNRR09","MENDOZA PEREZ JORGE ALBERTO",0,"PA",20,20070516,20131231,"DOCENTE FRENTE A GRUPO",21502.829999999994]
[null,"SAN LUIS POTOSI","24DPT0007O","MOGL751224U33","MOGL751224MSPRLR02","MORALES GALICIA MA. DE LOURDES",0,"PA",14,20130812,20131231,"DOCENTE FRENTE A GRUPO",3778.2899999999991]
[null,"SAN LUIS POTOSI","24DPT0007O","MUGP870205AV5","MUGP870205MSPXMM02","MUÑIZ GOMEZ PAMELA",0,"PA",19,20130812,20131231,"DOCENTE FRENTE A GRUPO",15483.769999999999]
[null,"SAN LUIS POTOSI","24DPT0007O","NASG680512QM4","NASG680512HSPRNL01","NARVAEZ SANCHEZ GUILLERMO",0,"PC",20,20070501,20131231,"DOCENTE FRENTE A GRUPO",24198.3]
[null,"SAN LUIS POTOSI","24DPT0007O","NASP620425RH3","NASP620425HSPVSD03","NAVARRETE SOSA PEDRO ANTONIO",0,"PA",16,20130812,20131231,"DOCENTE FRENTE A GRUPO",7468.989999999998]
[null,"SAN LUIS POTOSI","24DPT0007O","OAGV7608069K8","OAGV760806HSPXRC03","OÑATE GARCIA JOSE VICTOR",0,"PB",20,20070501,20131231,"DOCENTE FRENTE A GRUPO",18154.760000000002]
[null,"SAN LUIS POTOSI","24DPT0007O","PEMT680208272","PEMT680208MSPXZR07","PEÑA DE LA MAZA MARIA TERESA DE JESUS",0,"PC",20,20070501,20131231,"DOCENTE FRENTE A GRUPO",25440.21]
[null,"SAN LUIS POTOSI","24DPT0007O","PEBD761216MQ9","PEBD761216MMCRRL02","PEREZ BRAVO DULCE MARIA",0,"PA",20,20090810,20131231,"DOCENTE FRENTE A GRUPO",22458.73]
[null,"SAN LUIS POTOSI","24DPT0007O","PEGJ790701TZ6","PEGJ790701HASRNL07","PEREZ GONZALEZ JULIO CESAR",0,"PA",20,20080204,20131231,"DOCENTE FRENTE A GRUPO",16837.670000000002]
[null,"SAN LUIS POTOSI","24DPT0007O","PEMA781108LS3","PEMA781108MSPRXN05","PEREZ MUÑIZ ANA LUISA",0,"PA",20,20080811,20131231,"DOCENTE FRENTE A GRUPO",20729.96]
[null,"SAN LUIS POTOSI","24DPT0007O","PETC6811049X1","PETC681104HSPRRR06","PEREZ TERAN CARLOS",0,"PC",20,20070501,20131231,"DOCENTE FRENTE A GRUPO",23651.11]
[null,"SAN LUIS POTOSI","24DPT0007O","PETL610331JG9","PETL610331HSPRRS06","PEREZ TERAN JOSE LUIS",0,"PA",16,20130812,20131231,"DOCENTE FRENTE A GRUPO",15024.23]
[null,"SAN LUIS POTOSI","24DPT0007O","QUMM721121LP","QUMM721121MSPNRR03","QUINTANILLA MARTINEZ MAURA REBECA",0,"PC",20,20070501,20131231,"DOCENTE FRENTE A GRUPO",23883.42]
[null,"SAN LUIS POTOSI","24DPT0007O","RARL5606213B1","RARL560621HSPMNS06","RAMIREZ RINCON LUIS",0,"PC",20,20070501,20131231,"DOCENTE FRENTE A GRUPO",23680.1]
[null,"SAN LUIS POTOSI","24DPT0007O","ROLA600205R52","ROLA600205MSPDPD01","RODRIGUEZ LOPEZ ADRIANA LETICIA",0,"PA",20,20100810,20131231,"DOCENTE FRENTE A GRUPO",20484.36]
[null,"SAN LUIS POTOSI","24DPT0007O","TINA691007H57","TINA691007HSPRJR05","TIRADO NAJERA ARTURO",0,"PC",20,20070501,20131231,"DOCENTE FRENTE A GRUPO",19975.049999999996]
[null,"SAN LUIS POTOSI","24DPT0007O","TOZR761021T4A","TOZR761021HSPBCF09","TOBIAS ZACARIAS RAFAEL",0,"PC",20,20070501,20131231,"DOCENTE FRENTE A GRUPO",23328.949999999997]
[null,"SAN LUIS POTOSI","24DPT0007O","TOMI610123MF0","TOMI610123HSPVRL08","TOVAR MARTINEZ ILDEFONSO",0,"PC",20,20070501,20131231,"DOCENTE FRENTE A GRUPO",21685.42]
[null,"SAN LUIS POTOSI","24DPT0007O","VARN6802263L9","VARN680226HSPZMS07","VAZQUEZ RAMIREZ NASARIO",0,"PA",18,20130812,20131231,"DOCENTE FRENTE A GRUPO",16852.269999999997]
[null,"SAN LUIS POTOSI","24DPT0007O","VERR770815LE8","VEER770815HSPRVY08","VERA REVELES RAYMUNDO JESUS",0,"PA",20,20070501,20131231,"DOCENTE FRENTE A GRUPO",-1530.0900000000001]
[null,"SAN LUIS POTOSI","24DPT0007O","VIRR820407UD6","VIRR820407HSPLDC07","VILLANUEVA RODRIGUEZ RICARDO AUGUSTO",0,"PA",20,20130812,20131231,"DOCENTE FRENTE A GRUPO",11464.92]
[null,"SAN LUIS POTOSI","24DPT0007O","ZUVP7411101R4","ZUVP741110HSPXND04","ZUÑIGA VENTURA PEDRO",0,"PA",20,20070501,20131231,"DOCENTE FRENTE A GRUPO",18454.32]
[null,"SAN LUIS POTOSI","24DPT0009M","MOEA5904238FA","MOEA590423HGTCSD04","ADALBERTO MOCTEZUMA ESTRADA",0,"PC",20,20070501,20130715,"DOCENTE FRENTE A GRUPO",17924.489999999998]
[null,"SAN LUIS POTOSI","24DPT0009M","BECA5712192K9","BECA571219HGRNRD04","ADAN BENITEZ  CARDOSO",0,"PA",20,20070501,20130715,"DOCENTE FRENTE A GRUPO",6526.7690000000011]
[null,"SAN LUIS POTOSI","24DPT0009M","RAMA401010NW3","RAMA401010HSPMRG01","AGUSTIN RAMIREZ MURGUIA",0,"PB",20,20070501,20130715,"DOCENTE FRENTE A GRUPO",8005.3100000000013]
[null,"SAN LUIS POTOSI","24DPT0009M","OELA460529MR5","OELA460529MSPRSL02","ALEJANDRINA ORELLANA LASTRE",0,"PB",16,20070501,20130715,"DOCENTE FRENTE A GRUPO",13678.210000000001]
[null,"SAN LUIS POTOSI","24DPT0009M","GAGA651210UL1","GAGA651210HSPRRL03","ALFREDO GARCIA GARCIA",0,"PC",20,20070501,20130715,"DOCENTE FRENTE A GRUPO",11474.341799999998]
[null,"SAN LUIS POTOSI","24DPT0009M","GOGA740612IVA","GOGA740612MMCMVL04","ALMA DELIA GOMEZ GUEVARA",0,"PB",20,20070501,20130715,"DOCENTE FRENTE A GRUPO",13330.1518]
[null,"SAN LUIS POTOSI","24DPT0009M","AARA750630J19","AARA750630MSPLBN00","ANA KARINA ALVARADO ROBLEDO",0,"PA",20,20070501,20130715,"DOCENTE FRENTE A GRUPO",14119.210000000001]
[null,"SAN LUIS POTOSI","24DPT0009M","HEGA550329U57","HEGA550329MSPRTN07","ANA MA. VIOLETA HERNANDEZ GUTIERREZ",0,"PA",20,20070501,20130715,"DOCENTE FRENTE A GRUPO",14404.949999999999]
[null,"SAN LUIS POTOSI","24DPT0009M","VAHA700212797","VAHA700212MTSZRR08","ARISTEA VAZQUEZ HERNANDEZ",0,"PA",20,20100216,20130715,"DOCENTE FRENTE A GRUPO",3745.5594000000001]
[null,"SAN LUIS POTOSI","24DPT0009M","RORA6702065V1","RORA670206HDGDDR08","ARMANDO RODRIGUEZ RODRIGUEZ",0,"PC",20,20070501,20130715,"DOCENTE FRENTE A GRUPO",15777.02]
[null,"SAN LUIS POTOSI","24DPT0009M","ROVA670604Q3A","ROVA670604HSPDRR06","ARNOLDO RODRIGUEZ VARELA",0,"TA",20,20070501,20130715,"DOCENTE FRENTE A GRUPO",-198481.04700800002]
[null,"SAN LUIS POTOSI","24DPT0009M","BEGB530213FVA","BEGB530213HSPTMN03","BENIGNO  BETANCOURT GOMEZ",0,"PC",20,20070501,20130715,"DOCENTE FRENTE A GRUPO",16726.370000000003]
[null,"SAN LUIS POTOSI","24DPT0009M","RORB561112GP8","RORB561112HSPJDN08","BENJAMIN ROJAS RODRIGUEZ",0,"PC",20,20070501,20130715,"DOCENTE FRENTE A GRUPO",16839.810000000001]
[null,"SAN LUIS POTOSI","24DPT0009M","MASB6902131Q9","MASB690213MSPRCL09","BLANCA ESTELA MARTINEZ SAUCEDO",0,"PA",20,20091016,20130715,"DOCENTE FRENTE A GRUPO",4918.5760999999993]
[null,"SAN LUIS POTOSI","24DPT0009M","CAGC810922339","CAGC810922MSPNZL09","CLAUDIA IVONE CANELA  GUZMAN",0,"PA",20,20070501,20130715,"DOCENTE FRENTE A GRUPO",15836.26999999999]
[null,"SAN LUIS POTOSI","24DPT0009M","MESC800926CZ5","MESC800926HSPNLT03","CUITLAHUAC MENDEZ SALADO",0,"PA",20,20070501,20130715,"DOCENTE FRENTE A GRUPO",310.02999999999997]
[null,"SAN LUIS POTOSI","24DPT0009M","HELD680228RP9","HELD680228HSPRPV08","DAVID HERNANDEZ LOPEZ",0,"PC",20,20070501,20130715,"DOCENTE FRENTE A GRUPO",19320.329999999994]
[null,"SAN LUIS POTOSI","24DPT0009M","MABE7612078W9","MABE761207MSPRRD09","EDISA MARQUEZ BARRIOS",0,"PC",20,20070501,20130715,"DOCENTE FRENTE A GRUPO",18286.2]
[null,"SAN LUIS POTOSI","24DPT0009M","RIBE540723J49","RIBE540723HSPVRD02","EDUARDO RIVERA BERRONES",0,"PA",20,20090201,20130715,"DOCENTE FRENTE A GRUPO",13610.880000000001]
[null,"SAN LUIS POTOSI","24DPT0009M","VEME560602PR6","VEME560602HSPGRM09","EMILIO VEGA MARTINEZ",0,"PB",20,20070501,20130715,"DOCENTE FRENTE A GRUPO",6841.0980000000009]
[null,"SAN LUIS POTOSI","24DPT0009M","OOGE690102199","OOGE690102HPLSRR04","ERNESTO OSORIO GARCÍA",0,"PA","9",20130701,20130915,"DOCENTE FRENTE A GRUPO",2155.66]
[null,"SAN LUIS POTOSI","24DPT0009M","RARF540425K35","RARF540425HSPMND06","FEDERICO RAMIREZ RINCON",0,"PC",20,20100316,20130715,"DOCENTE FRENTE A GRUPO",15247.649999999989]
[null,"SAN LUIS POTOSI","24DPT0009M","GUMF450823BM4","GUMF450823HSPRRL02","FELIPE GUERRERO MARTINEZ",0,"PA",20,20070501,20130715,"DOCENTE FRENTE A GRUPO",13792.090000000002]
[null,"SAN LUIS POTOSI","24DPT0009M","LOAF6906051R4","LOAF690605HGTPRL07","FELIX MANUEL LOPEZ ARMAS",0,"PA",20,20070501,20130715,"DOCENTE FRENTE A GRUPO",7200.4862999999996]
[null,"SAN LUIS POTOSI","24DPT0009M","GOAF5909036G4","GOAF590903HSPNLR01","FERNANDO  GONZALEZ ALMENDAREZ",0,"PA",20,20080916,20130715,"DOCENTE FRENTE A GRUPO",7351.951399999989]
[null,"SAN LUIS POTOSI","24DPT0009M","ROMF680716254","ROMF680716HSPDRR09","FRANCISCO JAVIER RODRIGUEZ MARQUEZ",0,"PC",20,20070501,20130715,"DOCENTE FRENTE A GRUPO",9309.3004999999903]
[null,"SAN LUIS POTOSI","24DPT0009M","NALG680106UY1","NALG680106MSPVPB05","GABRIELA NAVARRO LOPEZ",0,"TA",20,20070501,20130715,"DOCENTE FRENTE A GRUPO",7839.7676400000009]
[null,"SAN LUIS POTOSI","24DPT0009M","IAPG671028ED7","IAPG671028MSPRLL04","GLORIA ESTHER  IRACHETA  PALOMINO",0,"PA",10,20120209,20130715,"DOCENTE FRENTE A GRUPO",731.34407999999894]
[null,"SAN LUIS POTOSI","24DPT0009M","SORG4905111P6","SORG490511MSPBMD01","GUADALUPE SOUBERBILLE RAMIREZ",0,"PA",20,20070501,20130715,"DOCENTE FRENTE A GRUPO",4133.5599999999995]
[null,"SAN LUIS POTOSI","24DPT0009M","BERH801030EA1","BERH801030HSPRBR04","HIRAM ISRAEL BERNAL  ROBLEDO",0,"PA",20,20070501,20130715,"DOCENTE FRENTE A GRUPO",14261.31]
[null,"SAN LUIS POTOSI","24DPT0009M","HEBI760906877","HEBI760906MSPRLN03","INDIRA ITZEL HERNANDEZ BLANCO",0,"PB",20,20070501,20130715,"DOCENTE FRENTE A GRUPO",13272.5]
[null,"SAN LUIS POTOSI","24DPT0009M","NORI770117MK2","NORI770117MVZCYR00","IRANI CRISTAL NOUCHE REYNA",0,"PA",20,20070501,20130715,"DOCENTE FRENTE A GRUPO",9373.7302600000003]
[null,"SAN LUIS POTOSI","24DPT0009M","AURC720705LI8","AURC720705HSPGDR08","J. CRUZ FRANCISCO AGUILLON RODRIGUEZ",0,"PA",20,20070501,20130715,"DOCENTE FRENTE A GRUPO",11653.909999999987]
[null,"SAN LUIS POTOSI","24DPT0009M","GAAJ560927TMA","GAAJ560927HZSLLS17","J. JESUS GALVAN ALVAREZ",0,"PC",20,20070501,20130715,"DOCENTE FRENTE A GRUPO",7201.0700000000006]
[null,"SAN LUIS POTOSI","24DPT0009M","AERJ5601224J5","AERJ560122HZSCDM02","JAIME ACEVEDO  RODRIGUEZ",0,"PB",20,20070501,20130715,"DOCENTE FRENTE A GRUPO",10798.17]
[null,"SAN LUIS POTOSI","24DPT0009M","JISJ781111I10","JISJ781111MSPMLN01","JANI ARELI JIMENEZ SILVA",0,"PB",20,20070501,20130715,"DOCENTE FRENTE A GRUPO",16094.720000000003]
[null,"SAN LUIS POTOSI","24DPT0009M","FOAJ440312DR1","FOAJ440312HSPLLV01","JAVIER FLORES ALVARADO",0,"PB",20,20070501,20130715,"DOCENTE FRENTE A GRUPO",14910.750000000011]
[null,"SAN LUIS POTOSI","24DPT0009M","AEBJ400825AUA","AEBJ400825HDFRLL08","JOEL ARMENDARIZ BLAZQUEZ",0,"PB",20,20070501,20130715,"DOCENTE FRENTE A GRUPO",16312.560000000001]
[null,"SAN LUIS POTOSI","24DPT0009M","EIGJ460405L10","EIGJ460405HHGSRR06","JORGE VICENTE ESPINOLA GARCIA",0,"PA",20,20080901,20130715,"DOCENTE FRENTE A GRUPO",13724.699999999999]
[null,"SAN LUIS POTOSI","24DPT0009M","GAGA480307S50","GAGA480307HSPSND09","JOSE ADRIAN GASCA GONZALEZ",0,"PA",20,20070501,20130715,"DOCENTE FRENTE A GRUPO",7246.8188000000009]
[null,"SAN LUIS POTOSI","24DPT0009M","VARA690110SH8","VARA690110HSPRMN02","JOSE ANGEL VARGAS RAMIREZ",0,"PC",20,20070501,20130715,"DOCENTE FRENTE A GRUPO",17999.739999999998]
[null,"SAN LUIS POTOSI","24DPT0009M","DIPA460121GU5","DIPA460121HSPZDN04","JOSE ANTONIO DIAZ  PEDROZA",0,"PC",10,20070501,20130715,"DOCENTE FRENTE A GRUPO",11839.53]
[null,"SAN LUIS POTOSI","24DPT0009M","MAAA8603143Z2","MAAA860314HSPRLN07","JOSE ANTONIO MARTINEZ ALVARADO",0,"PA",20,20090816,20130715,"DOCENTE FRENTE A GRUPO",13905.600000000002]
[null,"SAN LUIS POTOSI","24DPT0009M","MOGC610503EQ7","MOGC610503HSPRRR03","JOSE CRUZ MORENO  GUERRERO",0,"PC",20,20070501,20130715,"DOCENTE FRENTE A GRUPO",8005.1183919999967]
[null,"SAN LUIS POTOSI","24DPT0009M","SASG591128V18","SASG591128HSPNLD09","JOSE GUADALUPE SANCHEZ SILVA",0,"PC",20,20070501,20130715,"DOCENTE FRENTE A GRUPO",11571.784999999998]
[null,"SAN LUIS POTOSI","24DPT0009M","RAMJ530309U28","RAMJ530309HSPMNN00","JOSE JUAN RAMIREZ MENDEZ",0,"PB",20,20070501,20130715,"DOCENTE FRENTE A GRUPO",16783.692071999998]
[null,"SAN LUIS POTOSI","24DPT0009M","EAAL600305LZ9","EAAL600305HCHSLS03","JOSE LUIS ESCAMILLA ALVARADO",0,"PA",20,20070501,20130715,"DOCENTE FRENTE A GRUPO",15300.52]
[null,"SAN LUIS POTOSI","24DPT0009M","JAML440222QT9","JAML440222HDFMRS07","JOSE LUIS JAIMES MURILLO",0,"PB",20,20070501,20130715,"DOCENTE FRENTE A GRUPO",12469.228999999999]
[null,"SAN LUIS POTOSI","24DPT0009M","PEDL500618HKA","PEDL500618HASRRS04","JOSE LUIS PERALES DURAN",0,"PB",10,20070501,20130715,"DOCENTE FRENTE A GRUPO",8394.52]
[null,"SAN LUIS POTOSI","24DPT0009M","SETM681012ASA","SETM681012HSPRRR01","JOSE MARTIN SERNA TORRES",0,"PB",20,20070501,20130715,"DOCENTE FRENTE A GRUPO",10597.640017999998]
[null,"SAN LUIS POTOSI","24DPT0009M","HEJV660214BB3","HEJV660214HSPRRL02","JOSE VALENTIN HERNANDEZ JARA",0,"PB",20,20070501,20130715,"DOCENTE FRENTE A GRUPO",258.25735999998915]
[null,"SAN LUIS POTOSI","24DPT0009M","CEGJ59031222A","CEGJ590312MSPRRS11","JOSEFINA CERDA GARCIA",0,"PC",20,20070501,20130715,"DOCENTE FRENTE A GRUPO",10330.330099999999]
[null,"SAN LUIS POTOSI","24DPT0009M","GOMJ530811FX9","GOMJ530811HSPDRN03","JUAN ANTONIO GODINEZ MARTINEZ",0,"PA",20,20070501,20130715,"DOCENTE FRENTE A GRUPO",10981.290000000003]
[null,"SAN LUIS POTOSI","24DPT0009M","GUHJ580201NN2","GUHJ580201MSPTRN07","JUANA ROSALBA GUTIERREZ HUERTA",0,"PB",20,20070501,20130715,"DOCENTE FRENTE A GRUPO",15541.07]
[null,"SAN LUIS POTOSI","24DPT0009M","SIRJ740930AC0","SIRJ740930HCLLDL04","JULIAN SILOS RODRIGUEZ",0,"PB",20,20070501,20130715,"DOCENTE FRENTE A GRUPO",6145.7345599999971]
[null,"SAN LUIS POTOSI","24DPT0009M","GOAK791020NR5","GOAK791020MSPNBR02","KARLA GONZALEZ ABUNDIS",0,"PA",20,20070501,20130715,"DOCENTE FRENTE A GRUPO",13130.979999999998]
[null,"SAN LUIS POTOSI","24DPT0009M","COAL690815CZ6","COAL690815MSPRRR09","LAURA CORTES ARRIAGA",0,"PC",20,20070501,20130715,"DOCENTE FRENTE A GRUPO",18228.179999999997]
[null,"SAN LUIS POTOSI","24DPT0009M","GOLL770316DG2","GOLL770316MSPNPR02","LAURA PATRICIA GONZALEZ LOPEZ",0,"PC",20,20070501,20130715,"DOCENTE FRENTE A GRUPO",7194.1333999999979]
[null,"SAN LUIS POTOSI","24DPT0009M","VEML550517KBA","VEML550517MSPLRT04","LETICIA VELAZQUEZ MORALES",0,"PA",20,20090216,20130715,"DOCENTE FRENTE A GRUPO",7215.130000000001]
[null,"SAN LUIS POTOSI","24DPT0009M","IASL4403122B2","IASL440312HSPZLC11","LUCAS  IZAGUIRRE SILVA",0,"PB",20,20070501,20130715,"DOCENTE FRENTE A GRUPO",14962.840000000002]
[null,"SAN LUIS POTOSI","24DPT0009M","RITL670216PK2","RITL670216HSPVRS00","LUIS FERNANDO RIVERA TURRUBIARTES",0,"PB",20,20070501,20130715,"DOCENTE FRENTE A GRUPO",15661.9]
[null,"SAN LUIS POTOSI","24DPT0009M","RAYL6402118J6","RAYL640211MSPMXZ05","LUZ ELENA RAMIREZ YAÑEZ",0,"PB","20",20070501,20130730,"DOCENTE FRENTE A GRUPO",12037.71999999999]
[null,"SAN LUIS POTOSI","24DPT0009M","LOHJ6210136P8","LOHJ621013MSPPRV08","MA. JOVITA LOPEZ HERNANDEZ",0,"PC",20,20070501,20130715,"DOCENTE FRENTE A GRUPO",9192.16]
[null,"SAN LUIS POTOSI","24DPT0009M","EAHM671124PBA","EAHM671124MTSSRG07","MAGALY ESTRADA HERNANDEZ",0,"PC",20,20070501,20130715,"DOCENTE FRENTE A GRUPO",8324.2262999999894]
[null,"SAN LUIS POTOSI","24DPT0009M","DIDM570116BV9","DIDM570116MSPZVR09","MARCELA IMELDA DIAZ DAVILA",0,"PA",20,20070501,20130715,"DOCENTE FRENTE A GRUPO",13691.329999999998]
[null,"SAN LUIS POTOSI","24DPT0009M","MOSM5107184H6","MOSM510718HSPSVR01","MARCO ANTONIO MONSIVAIS SAAVEDRA",0,"PC",20,20070501,20130715,"DOCENTE FRENTE A GRUPO",17293.79]
[null,"SAN LUIS POTOSI","24DPT0009M","DESC5311153R9","DESC531115MSPLVR05","MARIA DEL CARMEN DELGADO SAAVEDRA",0,"PC",20,20070501,20130715,"DOCENTE FRENTE A GRUPO",17810.009999999998]
[null,"SAN LUIS POTOSI","24DPT0009M","ZAHS690627LN1","ZAHS690627MSPVRC02","MARIA DEL SOCORRO ZAVALA  HERNANDEZ",0,"PC",20,20070501,20130715,"DOCENTE FRENTE A GRUPO",14643.089999999987]
[null,"SAN LUIS POTOSI","24DPT0009M","GACG681201AW1","GACG681201MSPLSR09","MARIA GRISELDA GALVAN CASTRO",0,"PC",20,20070501,20130715,"DOCENTE FRENTE A GRUPO",10928.700999999999]
[null,"SAN LUIS POTOSI","24DPT0009M","PIPG620110UQ4","PIPG620110MCSNLD07","MARIA GUADALUPE PINEDA PALOMEQUE",0,"PC",20,20070501,20130715,"DOCENTE FRENTE A GRUPO",9946.329999999989]
[null,"SAN LUIS POTOSI","24DPT0009M","AAMI700628346","AAMI700628MSPYNS03","MARIA ISABEL AYALA  MANRIQUE",0,"PC",20,20070501,20130715,"DOCENTE FRENTE A GRUPO",11324.374499999998]
[null,"SAN LUIS POTOSI","24DPT0009M","TOMI610628R81","TOMI610628MSPRNS04","MARIA ISABEL TORRES MONTERO",0,"PB",20,20070501,20130715,"DOCENTE FRENTE A GRUPO",15260.960000000003]
[null,"SAN LUIS POTOSI","24DPT0009M","LEGP7009225B7","LEGP700922MSPRNT06","MARIA PATRICIA LEURA GONZALEZ",0,"PC",20,20070501,20130715,"DOCENTE FRENTE A GRUPO",19549.209999999988]
[null,"SAN LUIS POTOSI","24DPT0009M","PIPM7007029U3","PIPM700702HOCNLR01","MARTIN OTHON PINEDA PALOMEQUE",0,"PB",20,20070501,20130715,"DOCENTE FRENTE A GRUPO",5570.2127719999971]
[null,"SAN LUIS POTOSI","24DPT0009M","MAVE851119B46","MAVE851119HSPRGD03","MARTINEZ VEGA EDOARDO ALEXANDRO",0,"PA",14,20130521,20130715,"DOCENTE FRENTE A GRUPO",10757.05]
[null,"SAN LUIS POTOSI","24DPT0009M","COHM800901KC1","COHM800901MSPRRR06","MARY CRUZ CORDOVA HERNANDEZ",0,"PA",20,20070501,20130715,"DOCENTE FRENTE A GRUPO",9252.218099999991]
[null,"SAN LUIS POTOSI","24DPT0009M","VAAM801130154","VAAM801130MSPZRR08","MARY LINDA VAZQUEZ ARIAS",0,"PB",20,20070501,20130715,"DOCENTE FRENTE A GRUPO",6745.197899999991]
[null,"SAN LUIS POTOSI","24DPT0009M","VELN790226NK7","VELN790226HSPGPS08","NESTOR DAVID VEGA LOPEZ",0,"PB",20,20070501,20130715,"DOCENTE FRENTE A GRUPO",8203.2462000000014]
[null,"SAN LUIS POTOSI","24DPT0009M","RUSO760607LB8","RUSO760607MSPVGL03","OLGA ELENA RUVALCABA SEGURA",0,"PB",20,20070501,20130715,"DOCENTE FRENTE A GRUPO",13986.020000000002]
[null,"SAN LUIS POTOSI","24DPT0009M","ROGO7506208V4","ROGO750620MJCDRL18","OLGA MIRIAM RODRIGUEZ GARCIA",0,"PA",20,20070501,20130715,"DOCENTE FRENTE A GRUPO",10421.656399999991]
[null,"SAN LUIS POTOSI","24DPT0009M","MOPR760718F85","MOPR760718HSPNDF01","RAFAEL   MONTANTE PADRON",0,"PB",20,20070501,20130715,"DOCENTE FRENTE A GRUPO",5582.0471200000102]
[null,"SAN LUIS POTOSI","24DPT0009M","CORR640814PJ5","CORR640814HSPLDF04","RAFAEL MARTIN COLUNGA RODRIGUEZ",0,"PC",20,20070501,20130715,"DOCENTE FRENTE A GRUPO",2845.486894000001]
[null,"SAN LUIS POTOSI","24DPT0009M","RURR611024A24","RURR611024HSPZNF04","RAFAEL RUIZ RANGEL",0,"PB",20,20070501,20130715,"DOCENTE FRENTE A GRUPO",13214.759999999998]
[null,"SAN LUIS POTOSI","24DPT0009M","SADR780305K50","SADR780305HSPLSF09","RAFAEL SALADO  DIOSDADO",0,"PA",20,20070501,20130715,"DOCENTE FRENTE A GRUPO",13160.769999999999]
[null,"SAN LUIS POTOSI","24DPT0009M","GOFR541109T40","GOFR541109HGTMLC03","RICARDO GOMEZ FLORES",0,"PA",20,20070501,20130715,"DOCENTE FRENTE A GRUPO",6559.7190999999993]
[null,"SAN LUIS POTOSI","24DPT0009M","RONR760726R81","RONR760726HSPDRB01","ROBERTO   RODRIGUEZ NARVAEZ",0,"PB",20,20070501,20130715,"DOCENTE FRENTE A GRUPO",15635.82]
[null,"SAN LUIS POTOSI","24DPT0009M","GARR550513GQ5","GARR550513HSPRDB07","ROBERTO PORFIRIO GARCIA RODRIGUEZ",0,"PA",20,20070501,20130715,"DOCENTE FRENTE A GRUPO",13242.06]
[null,"SAN LUIS POTOSI","24DPT0009M","SIVR460513GK8","SIVR460513HSPLRB09","ROBERTO SILVA VARGAS",0,"TA",20,20070501,20130715,"DOCENTE FRENTE A GRUPO",10098.73]
[null,"SAN LUIS POTOSI","24DPT0009M","VAMR7708202Y9","VAMR770820MSPLRC07","ROCIO YUNUEN VALDIVIA MARQUEZ",0,"PA",20,20080801,20130715,"DOCENTE FRENTE A GRUPO",13434.9]
[null,"SAN LUIS POTOSI","24DPT0009M","MACR460808JL8","MACR460808HDFRRG01","ROGELIO MARTINEZ CARDENAS",0,"PC",20,20070501,20130715,"DOCENTE FRENTE A GRUPO",16933.55]
[null,"SAN LUIS POTOSI","24DPT0009M","PEGR600809AM3","PEGR600809HSPRRM02","ROMAN PEREZ GARCIA",0,"PB",20,20070501,20130715,"DOCENTE FRENTE A GRUPO",15400.500000000002]
[null,"SAN LUIS POTOSI","24DPT0009M","VIMR530429552","VIMR530429MCLLDS02","ROSA ALICIA VILLEGAS  MEDELLIN",0,"PA",20,20110201,20130715,"DOCENTE FRENTE A GRUPO",15981.980000000001]
[null,"SAN LUIS POTOSI","24DPT0009M","MOPR6303238X2","MOPR630323MSPRRS06","ROSA AURELIA MORAN PERALES",0,"PC",20,20070501,20130715,"DOCENTE FRENTE A GRUPO",16367.48]
[null,"SAN LUIS POTOSI","24DPT0009M","AUZR620708VP7","AUZR620708MSPZXS00","ROSA MARIA AZUA ZUÑIGA",0,"PC","20",20070501,20130730,"DOCENTE FRENTE A GRUPO",17158.029999999992]
[null,"SAN LUIS POTOSI","24DPT0009M","VEPR840111TK9","VEPR840111MSOLNX02","ROXANA VELAZQUEZ PUENTE",0,"PA",20,20110316,20130715,"DOCENTE FRENTE A GRUPO",13813.95]
[null,"SAN LUIS POTOSI","24DPT0009M","LEMS430127168","LEMS430127HJCDRL07","SALVADOR LEDESMA MARTINEZ",0,"PC",20,20070501,20130715,"DOCENTE FRENTE A GRUPO",17117.299999999988]
[null,"SAN LUIS POTOSI","24DPT0009M","HEGS811219AY5","HEGS811219HSPRRR04","SERGIO EDUARDO HERNANDEZ GARCIA",0,"PA",20,20090601,20130715,"DOCENTE FRENTE A GRUPO",5557.4000000000005]
[null,"SAN LUIS POTOSI","24DPT0009M","OEDS690601H87","OEDS690601MSPRZL01","SILVIA GUADALUPE ORTEGA DIAZ",0,"PB",20,20070501,20130715,"DOCENTE FRENTE A GRUPO",9397.880000000001]
[null,"SAN LUIS POTOSI","24DPT0009M","EAPS800918S72","EAPS800918MSPSRS05","SUSANA ELIZABETH ESCALANTE PEREZ",0,"PA",20,20101201,20130715,"DOCENTE FRENTE A GRUPO",-3401.46]
[null,"SAN LUIS POTOSI","24DPT0009M","GOGV400220AE2","GOGV400220HSPNNC13","VICTOR GONZALEZ GONZALEZ",0,"PB",20,20070501,20130715,"DOCENTE FRENTE A GRUPO",14991.380000000001]
[null,"SAN LUIS POTOSI","24DPT0009M","SIMV7104087G7","SIMV710408HSPRNC00","VICTOR MANUEL SIERRA MONTOYA",0,"PA",20,20070501,20130715,"DOCENTE FRENTE A GRUPO",10658.408799999997]
[null,"SAN LUIS POTOSI","24DPT0009M","MAAY830329C07","MAAY830329MSPRLN06","YENDI NAYELI MARTINEZ ALVARADO",0,"PB",20,20070501,20130715,"DOCENTE FRENTE A GRUPO",14409.88]
[null,"SAN LUIS POTOSI","24DPT0009M","PEDY750108K77","PEDY750108MSPRZL03","YOLANDA GRICELDA PEREZ DIAZ",0,"PA",20,20100316,20130715,"DOCENTE FRENTE A GRUPO",15324.519999999999]
[]
[null,"Total Entidad Federativa Personas : ",null,364,null,null,null,null,null,null,null,"Subtotal Monto Pagado en el Periodo:",{"$f":"SUBTOTAL(109,Tabla14[Percepciones pagadas dentro del periodo reportado])","v":5409613.0731979981}]
[null,"NOTA: LOS TRABAJADORES ACADÉMICOS FUERON BASIFICADOS EN EL ESTADO, EL ESQUEMA DE PAGO ES MIXTO, YA QUE SE PAGAN 4715 HORAS SEMANA MES CON PRESUPUESTO FEDERAL (3288 HSM AL 100% Y 1427 AL 50%, ESTAS ÚLTIMAS CORRESPONDEN A INCREMENTOS A PARTIR DE LA FEDERALIZACIÓN), LAS DIFERENCIAS DE HORAS ASÍ COMO LAS PRESTACIONES DEL CONTRTATO COLECTIVO DE TRABAJO Y LA SEGURIDAD SOCIAL SE PAGA CON INGRESOS PROPIOS Y/O CON APORTACIÓN ESTATAL"]
[]
[null,null,null,null,null,null,null,null,null,"Total   Percepciones :",null,{"$f":"SUM(M383+'II C y 1_'!U188)","v":14475025.721298002}]
[]
[null,"Fuente : Información proporcionada por las Entidades Federativas"]

{"sheet":"II D) 7 1","index":10,"n_rows":55,"n_cols":19,"rows_kept":55,"cut":false,"hidden":false,"merged":[[8,17,8,18],[9,1,9,9],[12,6,13,6],[12,7,12,9],[12,10,13,10],[12,11,13,11],[12,12,13,12],[12,1,13,1],[12,2,13,2],[12,3,13,3],[12,4,13,4],[12,5,13,5],[12,17,13,17],[51,16,51,17],[12,18,13,18],[12,13,13,13],[12,14,13,14],[12,15,13,15],[12,16,13,16]]}
[]
[]
[]
[]
[]
[]
[]
[]
[null,"Formato: Analítico de Categorías / Plazas Autorizadas con su Tabulador",null,null,null,null,null,null,null,null,null,null,null,null,null,null,"Entidad Federativa:",{"$f":"IF('Caratula Resumen'!D21=\"Elige el Periodo…\",\"\",'Caratula Resumen'!D21)","v":" SAN LUIS"}]
[null,{"$f":"IF('Caratula Resumen'!D22=\"Elige el Periodo…\",\"\",'Caratula Resumen'!D22)","v":"Fondo de Aportaciones para la Educación Tecnológica y de Adultos/Colegio Nacional de Educación Profesional Técnica (FAETA/CONALEP)"},null,null,null,null,null,null,null,null,null,null,null,null,null,null,null,null,{"$f":"IF('Caratula Resumen'!D23=\"Elige el Periodo…\",\"\",'Caratula Resumen'!D23)","v":"3er. Trimestre"}]
[]
[]
[null,"Clave Tipo educativo","Clave Nivel educativo","Clave Subnivel educativo","Descripción Nivel / Subnivel","Tipo Financiamiento","Partida Presupuestal","CATEGORIA",null,null,"Zona Económica","Nivel Puesto","Nivel Sueldo","Tipo Contratación","Monto mensual\npor plaza jornada","Monto mensual\nPor Plaza HSM","Número de Plazas Jornada","Número de Plazas HSM","Monto total autorizado"]
[null,null,null,null,null,null,null,"Tipo de Categoría"," Categoría","Descripción"]
[]
[null,"Clave Tipo educativo","Clave Nivel educativo","Clave Subnivel educativo","Descripción Nivel / Subnivel","Tipo Financiamiento","Partida Presupestal","Tipo de Categoría"," Categoría","Descripción","Zona Económica","Nivel Puesto","Nivel Sueldo","Tipo Contratación","Monto mensual\npor plaza jornada","Monto mensual\nPor Plaza HSM","Número de Plazas Jornada","Número de Plazas HSM","Monto total autorizado"]
[null,2,21,23,"BACHILLERATO TÉCNICO",1,1131,2,"A01801","ADMINISTRATIVO TÉCNICO ESPECIALISTA","B",11,1,"P",7899.5690000000004,0,2,0,15799.138000000001]
[null,2,21,23,"BACHILLERATO TÉCNICO",1,1131,2,"A03202","SECRETARÍA \"C\"","B",5,1,"P",6334.3674000000001,0,12,0,76012.408800000005]
[null,2,21,23,"BACHILLERATO TÉCNICO",1,1131,5,"CF02100","SUBCOORDINADOR","B",16,1,"P",7385.76,0,3,0,22157.279999999999]
[null,2,21,23,"BACHILLERATO TÉCNICO",1,1131,5,"CF02105","COORDINADOR EJECUTIVO II","B",19,1,"P",7115.7,0,3,0,21347.1]
[null,2,21,23,"BACHILLERATO TÉCNICO",1,1131,2,"CF04201","SECRETARIA \"B\"","B",7,1,"P",6846.3346000000001,0,3,0,20539.003799999999]
[null,2,21,23,"BACHILLERATO TÉCNICO",1,1131,5,"CF11100","REPRESENTANTE","B",20,1,"P",11552.22,0,1,0,11552.22]
[null,2,21,23,"BACHILLERATO TÉCNICO",1,1131,2,"CF18203","SUPERVISOR DE MANTENIMIENTO","B",9,1,"P",7367.1854000000003,0,5,0,36835.927000000003]
[null,2,21,23,"BACHILLERATO TÉCNICO",1,1131,2,"CF19201","TUTOR ESCOLAR","B",6,1,"P",6588.9744000000001,0,7,0,46122.820800000001]
[null,2,21,23,"BACHILLERATO TÉCNICO",1,1131,2,"CF21202","ASISTENTE ESCOLAR Y SOCIAL","B",7,1,"P",6846.3346000000001,0,5,0,34231.673000000003]
[null,2,21,23,"BACHILLERATO TÉCNICO",1,1131,2,"CF33202","TÉCNICO EN CONTABILIDAD","B",9,1,"P",7367.1854000000003,0,1,0,7367.1854000000003]
[null,2,21,23,"BACHILLERATO TÉCNICO",1,1131,2,"CF33203","TÉCNICO FINANCIERO","B",9,1,"P",7367.1854000000003,0,2,0,14734.370800000001]
[null,2,21,23,"BACHILLERATO TÉCNICO",1,1131,2,"CF33204","SUBJEFE TÉCNICO ESPECIALISTA","B",13,1,"P",13029.527599999999,0,21,0,273620.0796]
[null,2,21,23,"BACHILLERATO TÉCNICO",1,1131,2,"CF33204","SUBJEFE TÉCNICO ESPECIALISTA","B",13,2,"P",12291.785599999999,0,1,0,12291.785599999999]
[null,2,21,23,"BACHILLERATO TÉCNICO",1,1131,2,"CF33204","SUBJEFE TÉCNICO ESPECIALISTA","B",13,3,"P",11633.1116,0,3,0,34899.334799999997]
[null,2,21,23,"BACHILLERATO TÉCNICO",1,1131,2,"CF33206","JEFE DE PROYECTO","B",15,1,"P",20090.000100000001,0,26,0,522340.00260000001]
[null,2,21,23,"BACHILLERATO TÉCNICO",1,1131,2,"CF33206","JEFE DE PROYECTO","B",15,2,"P",18953.074400000001,0,2,0,37906.148800000003]
[null,2,21,23,"BACHILLERATO TÉCNICO",1,1131,2,"CF33206","JEFE DE PROYECTO","B",15,3,"P",17937.711599999999,0,4,0,71750.846399999995]
[null,2,21,23,"BACHILLERATO TÉCNICO",1,1131,2,"CF34201","TÉCNICO BIBLIOTECARIO","B",6,1,"P",6588.9744000000001,0,4,0,26355.8976]
[null,2,21,23,"BACHILLERATO TÉCNICO",1,1131,2,"CF34202","PROMOTOR CULTURAL Y DEPORTIVO","B",5,1,"P",6334.3674000000001,0,2,0,12668.7348]
[null,2,21,23,"BACHILLERATO TÉCNICO",1,1131,2,"CF34202","PROMOTOR CULTURAL Y DEPORTIVO","B",5,3,"P",5656.0042999999996,0,3,0,16968.012900000002]
[null,2,21,23,"BACHILLERATO TÉCNICO",1,1131,5,"D004","DIRECTOR DE PLANTEL \"B\" Y \"C\" II","B",17,1,"P",7957.06,0,3,0,23871.18]
[null,2,21,23,"BACHILLERATO TÉCNICO",1,1131,5,"D005","DIRECTOR DE PLANTEL \"D\" Y \"E\" II","B",18,1,"P",7666.08,0,2,0,15332.16]
[null,2,21,23,"BACHILLERATO TÉCNICO",1,1131,2,"ED01201","TÉCNICO EN MATERIALES DIDÁCTICOS","B",6,1,"P",6588.9744000000001,0,3,0,19766.923200000001]
[null,2,21,23,"BACHILLERATO TÉCNICO",1,1131,2,"S01201","ASISTENTE DE SERVICIOS BÁSICOS","B",2,1,"P",5581.2482,0,7,0,39068.737399999998]
[null,2,21,23,"BACHILLERATO TÉCNICO",1,1131,2,"S01201","ASISTENTE DE SERVICIOS BÁSICOS","B",2,2,"P",5265.4441999999999,0,1,0,5265.4441999999999]
[null,2,21,23,"BACHILLERATO TÉCNICO",1,1131,2,"S01201","ASISTENTE DE SERVICIOS BÁSICOS","B",2,3,"P",4982.9400999999998,0,14,0,69761.161399999997]
[null,2,21,23,"BACHILLERATO TÉCNICO",1,1131,2,"S01202","AUXILIAR DE SERVICIOS GENERALES","B",4,1,"P",6082.0461999999998,0,20,0,121640.924]
[null,2,21,23,"BACHILLERATO TÉCNICO",1,1131,2,"S01202","AUXILIAR DE SERVICIOS GENERALES","B",4,2,"P",5737.7736000000004,0,3,0,17213.320800000001]
[null,2,21,23,"BACHILLERATO TÉCNICO",1,1131,2,"T08201","TÉCNICO EN GRAFICACIÓN","B",8,1,"P",7104.8378000000002,0,2,0,14209.6756]
[null,2,21,20,"PROFESIONAL TECNICO","FEDERAL",1131,3,"PC","PROFESIONAL INSTRUCTOR \"C\"","C",0,0,"H *",0,411.45,0,1776,1521336.375]
[null,2,21,20,"PROFESIONAL TECNICO","FEDERAL",1131,3,"PB","TECNICO CB II","C",0,0,"H *",0,356.5,0,1230,1184471.25]
[null,2,21,20,"PROFESIONAL TECNICO","FEDERAL",1131,3,"PA","TECNICO CB I","C",0,0,"H *",0,317.2,0,913,823609.79999999993]
[null,2,21,20,"PROFESIONAL TECNICO","FEDERAL",1131,3,"TA","TECNICO INSTRUCTOR \"A\"","C",0,0,"H *",0,233.15,0,796,556762.19999999995]
[]
[]
[null,null,null,null,null,null,null,null,null,null,null,null,null,"Total Jornada:",{"$f":"SUBTOTAL(109,Tabla15[Monto mensual\npor plaza jornada])","v":252151.77770000006},null,"Total Autorizado:",null,{"$f":"SUBTOTAL(109,Tabla15[Monto total autorizado])","v":5727809.1222999999}]
[null,"* NOTA: EL COSTO SEÑALADO DE LA HSM ES UNITARIO (POR HORA)",null,null,null,null,null,null,null,null,null,null,null,"Total HSM*"]
[null,"* Basificados Estatales"]
[null,"Fuente : Información proporcionada por las Entidades Federativas"]

{"sheet":"II D) 7 2 ","index":11,"n_rows":57,"n_cols":18,"rows_kept":57,"cut":false,"hidden":false,"merged":[[14,8,15,8],[14,9,14,13],[14,14,14,16],[10,16,10,17],[11,1,11,9],[14,1,15,1],[14,2,15,2],[14,3,15,3],[14,17,15,17],[14,6,15,6],[14,7,15,7],[14,4,15,4],[14,5,15,5]]}
[]
[]
[]
[]
[]
[]
[]
[]
[]
[]
[null,"Formato: Catálogo de Categorías y Tabuladores",null,null,null,null,null,null,null,null,null,null,null,null,null,"Entidad Federativa:",{"$f":"IF('Caratula Resumen'!D21=\"Elige el Periodo…\",\"\",'Caratula Resumen'!D21)","v":" SAN LUIS"}]
[null,{"$f":"IF('Caratula Resumen'!D22=\"Elige el Periodo…\",\"\",'Caratula Resumen'!D22)","v":"Fondo de Aportaciones para la Educación Tecnológica y de Adultos/Colegio Nacional de Educación Profesional Técnica (FAETA/CONALEP)"},null,null,null,null,null,null,null,null,null,null,null,null,null,null,null,{"$f":"IF('Caratula Resumen'!D23=\"Elige el Periodo…\",\"\",'Caratula Resumen'!D23)","v":"3er. Trimestre"}]
[]
[]
[null,"Identificador origen presupuestal de la plaza","Clave de categoría","Descripción de la categoría","Tipo de contratación","Tipo de categoría","Clave de concepto de pago","Clave de nivel de puesto","Clave de nivel de sueldo","Sueldo asignado por zona económica",null,null,null,null,"Datos adicionales de horas",null,null,"Fecha de actualización"]
[null,null,null,null,null,null,null,null,null,"Inicio de vigencia del sueldo","Fin de vigencia del sueldo","Monto Mensual Jornada ó de HSM\nZona A","Monto Mensual Jornada ó de HSM\nZona B","Monto Mensual Jornada ó de HSM\nZona C","Horas \nde compatibilidad","Horas de servicio (HSM)","Horas de docencia"]
[]
[null,"Identificador origen presupuestal de la plaza","Clave de categoría","Descripción de la categoría","Tipo de contratación","Tipo de categoría","Clave de concepto de pago","Clave de nivel de puesto","Clave de nivel de sueldo","Inicio de vigencia del sueldo","Fin de vigencia del sueldo","Monto Mensual Jornada ó de HSM\nZona A","Monto Mensual Jornada ó de HSM\nZona B","Monto Mensual Jornada ó de HSM\nZona C","Horas \nde compatibilidad","Horas de servicio (HSM)","Horas de docencia","Fecha de actualización"]
[null,1,"A01801","ADMINISTRATIVO TÉCNICO ESPECIALISTA","P",2,1003,11,1,201318,999999,null,7899.5690000000004,null,40,0,0,20130929]
[null,1,"A03202","SECRETARÍA \"C\"","P",2,1003,5,1,201318,999999,null,6334.3674000000001,null,40,0,0,20130929]
[null,1,"CF02100","SUBCOORDINADOR","P",5,1003,16,1,201318,999999,null,7385.76,null,40,0,0,20130929]
[null,1,"CF02105","COORDINADOR EJECUTIVO II","P",5,1003,19,1,201318,999999,null,7115.7,null,40,0,0,20130929]
[null,1,"CF04201","SECRETARIA \"B\"","P",2,1003,7,1,201318,999999,null,6846.3346000000001,null,40,0,0,20130929]
[null,1,"CF11100","REPRESENTANTE","P",5,1003,20,1,201318,999999,null,11552.22,null,40,0,0,20130929]
[null,1,"CF18203","SUPERVISOR DE MANTENIMIENTO","P",2,1003,9,1,201318,999999,null,7367.1854000000003,null,40,0,0,20130929]
[null,1,"CF19201","TUTOR ESCOLAR","P",2,1003,6,1,201318,999999,null,6588.9744000000001,null,40,0,0,20130929]
[null,1,"CF21202","ASISTENTE ESCOLAR Y SOCIAL","P",2,1003,7,1,201318,999999,null,6846.3346000000001,null,40,0,0,20130929]
[null,1,"CF33202","TÉCNICO EN CONTABILIDAD","P",2,1003,9,1,201318,999999,null,7367.1854000000003,null,40,0,0,20130929]
[null,1,"CF33203","TÉCNICO FINANCIERO","P",2,1003,9,1,201318,999999,null,7367.1854000000003,null,40,0,0,20130929]
[null,1,"CF33204","SUBJEFE TÉCNICO ESPECIALISTA","P",2,1003,13,1,201318,999999,null,13029.527599999999,null,40,0,0,20130929]
[null,1,"CF33204","SUBJEFE TÉCNICO ESPECIALISTA","P",2,1003,13,2,201318,999999,null,12291.785599999999,null,40,0,0,20130929]
[null,1,"CF33204","SUBJEFE TÉCNICO ESPECIALISTA","P",2,1003,13,3,201318,999999,null,11633.1116,null,40,0,0,20130929]
[null,1,"CF33206","JEFE DE PROYECTO","P",2,1003,15,1,201318,999999,null,20090.000100000001,null,40,0,0,20130929]
[null,1,"CF33206","JEFE DE PROYECTO","P",2,1003,15,2,201318,999999,null,18953.074400000001,null,40,0,0,20130929]
[null,1,"CF33206","JEFE DE PROYECTO","P",2,1003,15,3,201318,999999,null,17937.711599999999,null,40,0,0,20130929]
[null,1,"CF34201","TÉCNICO BIBLIOTECARIO","P",2,1003,6,1,201318,999999,null,6588.9744000000001,null,40,0,0,20130929]
[null,1,"CF34202","PROMOTOR CULTURAL Y DEPORTIVO","P",2,1003,5,1,201318,999999,null,6334.3674000000001,null,40,0,0,20130929]
[null,1,"CF34202","PROMOTOR CULTURAL Y DEPORTIVO","P",2,1003,5,3,201318,999999,null,5656.0042999999996,null,40,0,0,20130929]
[null,1,"D004","DIRECTOR DE PLANTEL \"B\" Y \"C\" II","P",5,1003,17,1,201318,999999,null,7957.06,null,40,0,0,20130929]
[null,1,"D005","DIRECTOR DE PLANTEL \"D\" Y \"E\" II","P",5,1003,18,1,201318,999999,null,7666.08,null,40,0,0,20130929]
[null,1,"ED01201","TÉCNICO EN MATERIALES DIDÁCTICOS","P",2,1003,6,1,201318,999999,null,6588.9744000000001,null,40,0,0,20130929]
[null,1,"S01201","ASISTENTE DE SERVICIOS BÁSICOS","P",2,1003,2,1,201318,999999,null,5581.2482,null,40,0,0,20130929]
[null,1,"S01201","ASISTENTE DE SERVICIOS BÁSICOS","P",2,1003,2,2,201318,999999,null,5265.4441999999999,null,40,0,0,20130929]
[null,1,"S01201","ASISTENTE DE SERVICIOS BÁSICOS","P",2,1003,2,3,201318,999999,null,4982.9400999999998,null,40,0,0,20130929]
[null,1,"S01202","AUXILIAR DE SERVICIOS GENERALES","P",2,1003,4,1,201318,999999,null,6082.0461999999998,null,40,0,0,20130929]
[null,1,"S01202","AUXILIAR DE SERVICIOS GENERALES","P",2,1003,4,2,201318,999999,null,5737.7736000000004,null,40,0,0,20130929]
[null,1,"T08201","TÉCNICO EN GRAFICACIÓN","P",2,1003,8,1,201318,999999,null,7104.8378000000002,null,40,0,0,20130929]
[null,2,"PC","PROFESIONAL INSTRUCTOR \"C\"","H *",3,1003,0,0,201318,999999,null,411.45,null,"0",20,1776,20130929]
[null,2,"PB","TECNICO CB II","H *",3,1003,0,0,201318,999999,null,356.5,null,"0",20,1230,20130929]
[null,2,"PA","TECNICO CB I","H *",3,1003,0,0,201318,999999,null,317.2,null,"0",20,913,20130929]
[null,2,"TA","TECNICO INSTRUCTOR \"A\"","H *",3,1003,0,0,201318,999999,null,233.15,null,"0",20,796,20130929]
[]
[null,null,null,null,null,null,null,null,null,null,"Total Zona A:",0]
[null,null,null,null,null,null,null,null,null,null,null,"Total Zona B:",{"$f":"SUM(M19:M53)","v":253470.07770000008}]
[null,"* NOTA: EL COSTO SEÑALADO DE LA HSM ES UNITARIO (POR HORA)",null,null,null,null,null,null,null,null,null,null,"Total Zona C:",0]
[null,"* Basificados Estatales"]
[null,"Fuente : Información proporcionada por las Entidades Federativas"]

{"sheet":"II D) 7 3","index":12,"n_rows":119,"n_cols":11,"rows_kept":119,"cut":false,"hidden":false,"merged":[[9,1,9,7],[8,9,8,10]]}
[]
[]
[]
[]
[]
[]
[]
[]
[null,"Formato: Catálogo de Percepciones y Deducciones",null,null,null,null,null,null,"Entidad Federativa:",{"$f":"IF('Caratula Resumen'!D21=\"Elige el Periodo…\",\"\",'Caratula Resumen'!D21)","v":" SAN LUIS"}]
[null,{"$f":"IF('Caratula Resumen'!D22=\"Elige el Periodo…\",\"\",'Caratula Resumen'!D22)","v":"Fondo de Aportaciones para la Educación Tecnológica y de Adultos/Colegio Nacional de Educación Profesional Técnica (FAETA/CONALEP)"},null,null,null,null,null,null,null,null,{"$f":"IF('Caratula Resumen'!D23=\"Elige el Periodo…\",\"\",'Caratula Resumen'!D23)","v":"3er. Trimestre"}]
[]
[]
[null,"Identificador origen presupuestal de la plaza","Tipo de concepto de pago ","Origen de financiamiento del concepto de percepciones.","Porcentaje de participación federal por fuente de recursos","Grupo al que pertenece concepto de pago (Percepción y/o Deducción)","Clave de concepto de pago","Descripción del concepto de pago ","Partida presupuestal","Fecha del","Fecha  al"]
[]
[null,"Identificador origen presupuestal de la plaza","Tipo de concepto de pago ","Origen de financiamiento del concepto de percepciones.","Porcentaje de participación federal por fuente de recursos","Grupo al que pertenece concepto de pago (Percepción y/o Deducción)","Clave de concepto de pago","Descripción del concepto de pago ","Partida presupuestal","Fecha del","Fecha  al"]
[null,1,"P","F",100,"P3",2518,"COMPENSACION GARANTIZADA",1131,20130715,99999999]
[null,1,"P","F",100,"P3",2517,"ESTIMULO POR PROD.",1131,20130715,99999999]
[null,1,"P","F",100,"P3",1003,"SALARIO BASE",1131,20130715,99999999]
[null,1,"P","F",100,"P3",1003,"SALARIO BASE ADMTVO.",1131,20130715,99999999]
[null,1,"P","F",100,"P3",2800,"DESPENSA",1131,20130715,99999999]
[null,1,"P","F",100,"P3",2766,"PRIMA DE ANTIGÜEDAD",1131,20130715,99999999]
[null,1,"P","F",100,"P3",2600,"PUNTUALIDAD Y ASISTENCIA",1131,20130715,99999999]
[null,1,"P","F",100,"P3",2625,"AYUDA PARA UTILES ESC.",1131,20130715,99999999]
[null,1,"P","F",100,"P3",2627,"ESTIMULO 10 DE MAYO",1131,20130715,99999999]
[null,1,"P","F",100,"P3",2850,"CONDICIONES INSALUBRES",1131,20130715,99999999]
[null,1,"P","F",100,"P3",3623,"PRIMA VAC. OPERATIVO",1131,20130715,99999999]
[null,1,"P","F",100,"P3",2754,"GUARDERIA",1131,20130715,99999999]
[null,1,"P","F",100,"P3",2655,"APARATOS ORTOPEDICOS",1131,20130715,99999999]
[null,1,"P","F",100,"P3",2680,"ANTEOJOS Y/O LENTES C.",1131,20130715,99999999]
[null,1,"P","F",100,"P3",2615,"CANASTILLA MATERNAL",1131,20130715,99999999]
[null,1,"P","F",100,"P3",1003,"DIAS NO TRABAJADOS ADMTVO.",1131,20130715,99999999]
[null,1,"P","F",100,"P3",1602,"DESARROLLO Y CAPACITACIÓN",1131,20130715,99999999]
[null,1,"P","F",100,"P3",1601,"APOYO PARA NUPCIAS",1131,20130715,99999999]
[null,1,"P","F",100,"P3",1603,"PREVISION SOCIAL MULT.",1131,20130715,99999999]
[null,1,"P","F",100,"P3",2830,"BONIF. I.S.R.",1131,20130715,99999999]
[null,1,"P","F",100,"P3",2680,"ANTEOJOS Y/O LENTES C..",1131,20130715,99999999]
[null,2,"P","M",0,"P1","AGUIM","AGUINALDO (FAETA APORT EST. E ING. PROPIOS)",1131,199901,99999999]
[null,2,"P","E",0,"P2","AUTES","AYUDA ÚTILES ESCOLARES",1131,200715,99999999]
[null,2,"P","I",0,"P2","BOFIA","BONO FIN DE AÑO (VALES DE DESPENSA)",1131,199901,99999999]
[null,2,"P","E",0,"P1","BOMAE","BONO DIA DEL MAESTRO",1131,200807,99999999]
[null,2,"P","E",0,"P1","BONAV","BONO NAVIDEÑO",1131,200823,99999999]
[null,2,"P","E",0,"P2","CAMAE","CANASTILLA MATERNAL",1131,200815,99999999]
[null,2,"P","E",0,"P2","DECON","DIAS ECONOMICOS",1131,200901,99999999]
[null,1,"P","F",100,"P1","EPCAS","ESTÍMULO POR CUMPLIR AÑOS DE SERVICIO",1131,199901,99999999]
[null,2,"P","M",0,"P1","ESDEA","ESTIMULO AL DESEMPEÑO ACADEMICO",1131,199901,99999999]
[null,2,"P","E",0,"P2","ESTDE","ESTIMULO AL DESEMPEÑO",1131,201201,99999999]
[null,2,"P","E",0,"P2","GDEFU","GASTOS POR DEFUNCION",1131,200815,99999999]
[null,1,"P","M",50,"P1","JUBPE","GRATIFICACIÓN POR JUBILACIÓN Y/O PENSIÓN",1131,199901,99999999]
[null,2,"P","E",0,"P2","MTDID","MATERIAL DIDACTICO",1131,200715,99999999]
[null,1,"P","F",100,"P2","PDEFU","PAGO POR DEFUNCIÓN",1131,199901,99999999]
[null,2,"P","M",0,"P1","PRIVA","PRIMA VACACIONAL",1131,200823,99999999]
[null,2,"P","M",0,"P1","RAGUI","RETROACTIVO DE AGUINALDO",1131,201210,99999999]
[null,2,"P","M",0,"P0","RETRO","RETROACTIVO",1131,201210,99999999]
[null,1,"P","I",0,"P1","REVOL","GRATIFICACIÓN POR RENUNCIA VOLUNTARIA",1131,199901,99999999]
[null,2,"P","M",0,"P1","RPVAC","RETROACTIVO DE PRIMA VACACIONAL",1131,201210,99999999]
[null,2,"P","M",0,"P3","SUBIN","SUB INCACPACIDAD",1131,200721,99999999]
[null,1,"P","F",100,"P1","TITUL","TITULACIÓN ",1131,199901,99999999]
[null,2,"P","M",98,"P1","VADES","VALES DE DESPENSA",1131,199901,99999999]
[null,1,"D","F",0,"D1",2920,"SEGURO DE RETIRO",0,20130715,99999999]
[null,1,"D","F",0,"D1",8523,"CUOTA SINDICAL ADMTVO.",0,20130715,99999999]
[null,1,"D","F",0,"D1",1927,"SEGURO DE DAÑOS FOVISSSTE",0,20130715,99999999]
[null,1,"D","F",0,"D1",5710,"ANTICIPO DE SUELDO",0,20130715,99999999]
[null,1,"D","F",0,"D1",8095,"CRED. HIP. CRECIENTE",0,20130715,99999999]
[null,1,"D","F",0,"D1",8135,"PMO. PERSONAL ISSSTE",0,20130715,99999999]
[null,1,"D","F",0,"D1",2912,"AHORRO SOLIDARIO",0,20130715,99999999]
[null,1,"D","F",0,"D1",5045,"I.S.P.T. A RETENER",0,20130715,99999999]
[null,1,"D","F",0,"D1",5045,"R. I.S.P.T. A RET.",0,20130715,99999999]
[null,1,"D","F",0,"D1",8580,"PEN. ALIM. 01",0,20130715,99999999]
[null,1,"D","F",0,"D1",8136,"CREDITO FONACOT",0,20130715,99999999]
[null,1,"D","F",0,"D1",6250,"SEG.SALUD T.ACTIVO",0,20130715,99999999]
[null,1,"D","F",0,"D1",6251,"SEG.SALUD T.PENSIONADO",0,20130715,99999999]
[null,1,"D","F",0,"D1",6252,"SEG.INVALIDEZ Y VIDA",0,20130715,99999999]
[null,1,"D","F",0,"D1",6253,"S.SOCIALES Y CULT.",0,20130715,99999999]
[null,1,"D","F",0,"D1",6254,"S.RET.CESANTIA AVZDA.",0,20130715,99999999]
[null,1,"D","F",0,"D1",2735,"SEGURO DE VIDA AHISA",0,20130715,99999999]
[null,1,"D","F",0,"D1",2915,"SEGURO DE GASTOS MEDICOS",0,20130715,99999999]
[null,1,"D","F",0,"D1",2951,"DESC. CAJA LIBERTAD",0,20130715,99999999]
[null,1,"D","F",0,"D1",2737,"SEGURO IND. METLIFE",0,20130715,99999999]
[null,1,"D","F",0,"D1",2950,"OTRAS DEDUCCIONES",0,20130715,99999999]
[null,1,"D","F",0,"D1",5045,"I.S.P.T. A RETENER.",0,20130715,99999999]
[null,1,"D","F",0,"D1",6044,"I.S.P.T. A RET. B.",0,20130715,99999999]
[null,1,"D","F",0,"D1",2880,"DESC. CREDIFIEL",0,20130715,99999999]
[null,1,"D","F",0,"D1",2718,"DESC.ISR 2012",0,20130715,99999999]
[null,1,"D","F",0,"D1",6250,"SEG.SALUD T.ACTIVO.",0,20130715,99999999]
[null,1,"D","F",0,"D1",6251,"SEG.SALUD T.PENSIONADO.",0,20130715,99999999]
[null,1,"D","F",0,"D1",6252,"SEG.INVALIDEZ Y VIDA.",0,20130715,99999999]
[null,1,"D","F",0,"D1",6253,"S.SOCIALES Y CULT..",0,20130715,99999999]
[null,1,"D","F",0,"D1",6254,"S.RET.CESANTIA AVZDA..",0,20130715,99999999]
[null,1,"D","F",0,"D1",2912,"AHORRO SOLIDARIO.",0,20130715,99999999]
[null,1,"D","F",0,"D1",5045,"I.S.P.T. A RETENER..",0,20130715,99999999]
[null,1,"D",0,0,"D2","AHVOL","AHORRO VOLUNTARIO EMPLEADO",0,201101,99999999]
[null,1,"D",0,0,"D1","AJSAL","AJUSTE SALARIAL",0,20120101,99999999]
[null,2,"D",0,0,"D3","ATSUE","ANTICIPO DE SUELDO",0,20071101,99999999]
[null,2,"D",0,0,"D3","CJAHO","CAJA DE AHORRO",0,20071101,99999999]
[null,2,"D",0,0,"D3","CJLIB","CAJA LIBERTAD",0,20090101,99999999]
[null,2,"D",0,0,"D3","CREDI","CREDIFIEL",0,201310,99999999]
[null,2,"D",0,0,"D2","CRHIP","CREDITO HIPOTECARIO CRECIENTE",0,199901,99999999]
[null,2,"D",0,0,"D3","CSACO","CUOTA SINDICAL SACONALEP",0,199901,99999999]
[null,2,"D",0,0,"D3","CSATT","CUOTA SINDICAL SATTCONALEP",0,199901,99999999]
[null,1,"D",0,0,"D2","DAÑFO","SEGURO DE DAÑOS FOVISSSTE",0,199901,99999999]
[null,2,"D",0,0,"D1","DECAN","DECLARACION ANUAL DE EJ ANT.",0,20071101,99999999]
[null,2,"D",0,0,"D2","FONAC","FONACOT",0,20090101,99999999]
[null,2,"D",0,0,"D1","IMSS","CUOTAS IMSS",0,20071101,99999999]
[null,2,"D",0,0,"D1","INCAP","INCAPACIDAD",0,20071101,99999999]
[null,2,"D",0,0,"D1","INCID","INCIDENCIAS",0,20071101,99999999]
[null,2,"D",0,0,"D1","INFON","INFONAVIT (AMORTIZCION)",0,20071101,99999999]
[null,2,"D",0,0,"D1","ISR","ISR POR SALARIO",0,199901,99999999]
[null,1,"D",0,0,"D1","ISSST","CUOTAS ISSSTE",0,199901,99999999]
[null,2,"D",0,0,"D2","MMAXA","SGMM AXA",0,20120101,99999999]
[null,2,"D",0,0,"D3","MTLIF","METLIFE",0,20090101,99999999]
[null,2,"D",0,0,"D3","OTRAS","OTRAS DEDUCCIONES",0,201306,99999999]
[null,1,"D",0,0,"D2","PMOIS","PRESTAMO PERSONAL ISSSTE",0,199901,99999999]
[null,2,"D",0,0,"D1","PNALI","PENSION ALIMENTICIA",0,20071101,99999999]
[null,2,"D",0,0,"D1","RETIR","SEGURO DE RETIRO",0,199901,99999999]
[null,2,"D",0,0,"D1","SUBEM","SUBSIDIO EMPLEO",0,20071101,99999999]
[]
[]
[]
[null,"Fuente : Información proporcionada por las Entidades Federativas"]

{"sheet":"E)","index":13,"n_rows":27,"n_cols":8,"rows_kept":27,"cut":false,"hidden":false,"merged":[[9,1,9,5],[12,1,14,1],[12,2,14,2],[13,7,14,7],[12,3,14,3],[12,4,14,4],[12,5,12,7],[13,5,14,5],[13,6,14,6]]}
[]
[]
[]
[]
[]
[]
[]
[]
[null,"Formato: Trabajadores que Cobran con RFC / CURP con Formato Incorreto"]
[null,{"$f":"IF('Caratula Resumen'!D22=\"Elige el Periodo…\",\"\",'Caratula Resumen'!D22)","v":"Fondo de Aportaciones para la Educación Tecnológica y de Adultos/Colegio Nacional de Educación Profesional Técnica (FAETA/CONALEP)"},null,null,null,null,null,{"$f":"IF('Caratula Resumen'!D23=\"Elige el Periodo…\",\"\",'Caratula Resumen'!D23)","v":"3er. Trimestre"}]
[]
[]
[null,"Entidad Federativa","RFC","CURP","NOMBRE TRABAJADOR","Motivo"]
[null,null,null,null,null,"Sin RFC o erroneo","RFC Sin Homoclave","Sin CURP o Erronea"]
[]
[]
[null,"Entidad Federativa","RFC","CURP","NOMBRE TRABAJADOR","Sin RFC o erroneo","RFC Sin Homoclave","Sin CURP o Erronea"]
[null,"SAN LUIS POTOSÍ","CARA7405111H3","CARA740511MNLSNN11  ","MA. DE LOS ANGEL CASTILLO RANGEL        ",null,null,"CARA740511MNLSNN11  "]
[null,"SAN LUIS POTOSÍ","OAHG511209TY7","OAHG511209MMNRND19  ","MA. GUADALUPE Y. ORDAZ HUANTE           ",null,null,"OAHG511209MMNRND19  "]
[null,"SAN LUIS POTOSÍ","LOMC710712LGA","LOMC710712MSPRDN03","LOREDO MEDINA MA. CONSUELO",null,null,"LOMC710712MSPRDN03"]
[null,"SAN LUIS POTOSÍ","ROEH761211SU0","ROEH761211HTSJSG04","ROJAS ESCAREÑO HUGO DANIEL","ROEH7612111R2"]
[]
[]
[null,"Total Personas : ",4,null,"Total Sin RFC o Erroneo:",1]
[null,null,null,null,null,"Total RFC Sin Homoclave:",0]
[null,null,null,null,null,null,"Total Sin CURP o Erroneo:",3]
[null,"Fuente : Información proporcionada por las Entidades Federativas"]

{"sheet":"F) 1","index":14,"n_rows":23,"n_cols":19,"rows_kept":23,"cut":false,"hidden":false,"merged":[[9,1,9,6],[12,15,13,15],[12,16,13,16],[12,17,12,18],[12,1,13,1],[12,2,13,2],[12,3,13,3],[12,4,13,4],[12,5,13,5],[12,6,13,6],[12,7,13,7],[12,8,12,14]]}
[]
[]
[]
[]
[]
[]
[]
[]
[null,"Formato: Trabajadores con Doble Asignación Salarial en Municipios no Colindantes Geográficamente"]
[null,{"$f":"IF('Caratula Resumen'!D22=\"Elige el Periodo…\",\"\",'Caratula Resumen'!D22)","v":"Fondo de Aportaciones para la Educación Tecnológica y de Adultos/Colegio Nacional de Educación Profesional Técnica (FAETA/CONALEP)"},null,null,null,null,null,null,null,null,null,null,null,null,null,null,null,null,{"$f":"IF('Caratula Resumen'!D23=\"Elige el Periodo…\",\"\",'Caratula Resumen'!D23)","v":"3er. Trimestre"}]
[]
[]
[null,"Entidad Federativa","Municipio","Localidad","RFC","CURP","Nombre del Trabajador","Clave integrada","Clave Presupuestal",null,null,null,null,null,null,"Clave CT","Nombre CT","Periodo en el CT"]
[null,null,null,null,null,null,null,null,"Partida Presupuestal","Código de Pago","Clave de Unidad","Clave de Sub Unidad","Clave de Categoría","Horas Semana Mes ","Número de Plaza",null,null,"Desde","Hasta"]
[]
[null,"Entidad Federativa","Municipio","Localidad","RFC","CURP","Nombre del Trabajador","Clave integrada","Partida Presupuestal","Código de Pago","Clave de Unidad","Clave de Sub Unidad","Clave de Categoría","Horas semana mes","Número de Plaza","Clave CT","Nombre CT","Periodo en el CT\nDesde","Periodo en el CTH\nasta"]
[]
[null,"Total Personas : ",null,null,null,null,null,null,null,null,null,null,"Total Plazas : "]
[]
[null,"NO APLICA PARA ESTE ORGANISMO PARA EL TERCER TRIMESTRE DEL 2013"]
[]
[null,"Fuente : Información proporcionada por las Entidades Federativas"]
[null,"Importante: Listar Sólo los Municipios no Colindantes"]

{"sheet":"F) 2","index":15,"n_rows":23,"n_cols":20,"rows_kept":23,"cut":false,"hidden":false,"merged":[[13,3,14,3],[13,4,14,4],[13,5,14,5],[10,1,10,9],[13,19,14,19],[13,18,14,18],[13,6,13,12],[13,13,14,13],[13,14,14,14],[13,15,14,15],[13,16,13,17],[13,1,14,1],[13,2,14,2]]}
[]
[]
[]
[]
[]
[]
[]
[]
[]
[null,"Formato: Trabajadores Ocupando Plazas que Superan el Número de Horas de Compatibilidad Autorizadas"]
[null,{"$f":"IF('Caratula Resumen'!D22=\"Elige el Periodo…\",\"\",'Caratula Resumen'!D22)","v":"Fondo de Aportaciones para la Educación Tecnológica y de Adultos/Colegio Nacional de Educación Profesional Técnica (FAETA/CONALEP)"},null,null,null,null,null,null,null,null,null,null,null,null,null,null,null,null,{"$f":"IF('Caratula Resumen'!D23=\"Elige el Periodo…\",\"\",'Caratula Resumen'!D23)","v":"3er. Trimestre"}]
[]
[]
[null,"Entidad Federativa","RFC","CURP","Nombre","Clave integrada","Clave Presupuestal",null,null,null,null,null,null,"CT","Nombre CT","Turno CT","Periodo",null,"Total de Horas en el CT","Horas de compatibilidad de la categoría"]
[null,null,null,null,null,null,"Partida Presupuestal","Código de Pago","Clave de Unidad","Clave de Sub Unidad","Clave de Categoría","Horas Semana Mes ","Número de Plaza",null,null,null,"Desde","Hasta"]
[]
[null,"Entidad Federativa","RFC","CURP","Nombre","Clave integrada","Partida Presupuestal","Código de Pago","Clave de Unidad","Clave de Sub Unidad","Clave de Categoría","Horas semana mes","Número de plaza","CT","Nombre CT","Turno CT","Periodo\nDesde","Periodo\nHasta","Total de Horas en el CT","Horas de compatibilidad de la categoría"]
[]
[null,"Total Personas : ",null,null,null,null,null,null,null,null,"Total Plazas : "]
[]
[null,"NO APLICA PARA ESTE ORGANISMO PARA EL TERCER TRIMESTRE DEL 2013"]
[]
[null,"Fuente : Información proporcionada por las Entidades Federativas"]

{"sheet":"G)","index":16,"n_rows":23,"n_cols":20,"rows_kept":23,"cut":false,"hidden":false,"merged":[[10,1,10,8],[12,5,12,11],[13,1,14,1],[13,2,14,2],[13,3,14,3],[13,4,14,4],[13,5,14,5],[13,6,13,12],[13,19,14,19],[13,13,14,13],[13,14,14,14],[13,15,13,16],[13,17,14,17],[13,18,14,18]]}
[]
[]
[]
[]
[]
[]
[]
[]
[]
[null,"Formato: Trabajadores Cuyo Salario Básico Supere los Ingresos Promedio de un Docente en la Categoría más Alta del Tabulador Salarial Correspondiente a Cada Entidad"]
[null,{"$f":"IF('Caratula Resumen'!D22=\"Elige el Periodo…\",\"\",'Caratula Resumen'!D22)","v":"Fondo de Aportaciones para la Educación Tecnológica y de Adultos/Colegio Nacional de Educación Profesional Técnica (FAETA/CONALEP)"},null,null,null,null,null,null,null,null,null,null,null,null,null,null,null,null,null,{"$f":"IF('Caratula Resumen'!D23=\"Elige el Periodo…\",\"\",'Caratula Resumen'!D23)","v":"3er. Trimestre"}]
[]
[]
[null,"Entidad Federativa","R.F.C.","CURP","Nombre","Clave integrada","Clave Presupuestal Integrada y Categoria aparte",null,null,null,null,null,null,"Clave CT Origen","Nombre CT","Periodo",null,"Monto de Remuneraciones Mensuales ","Monto de referencia","Diferencia\n(R-S)"]
[null,null,null,null,null,null,"Partida Presupuestal","Código de Pago","Clave de Unidad","Clave de Sub Unidad","Clave de Categoría","Horas Semana Mes ","Número de Plaza",null,null,"Desde","Hasta"]
[]
[null,"Entidad Federativa","R.F.C.","CURP","Nombre","Clave integrada","Partida Presupuestal","Código de Pago","Clave de Unidad","Clave de Sub Unidad","Clave de Categoría","Horas Semana Mes ","No. de plaza","CT","Nombre CT","Periodo\nDesde","Periodo\nHasta","Monto de Remuneraciones Mensuales ","Monto de referencia","Diferencia\n(R-S)"]
[]
[null,"Total Personas : ",null,null,null,null,null,null,null,null,null,null,null,null,"Total Remuneraciones Mensuales:"]
[]
[null,"NO APLICA PARA ESTE ORGANISMO PARA EL TERCER TRIMESTRE DEL 2013",null,null,null,null,null,null,null,null,null,null,null,null,null,null,null,"Total Diferencia:"]
[]
[null,"Fuente : Información proporcionada por las Entidades Federativas"]

{"sheet":"Listas","index":17,"n_rows":42,"n_cols":8,"rows_kept":42,"cut":false,"hidden":true,"merged":[]}
[]
[]
[]
[null,"Elige un Fondo…"]
[null,"Fondo de Aportaciones para la Educación Básica y Normal (FAEB)"]
[null,"Fondo de Aportaciones para la Educación Tecnológica y de Adultos/Colegio Nacional de Educación Profesional Técnica (FAETA/CONALEP)"]
[null,"Fondo de Aportaciones para la Educación Tecnológica y de Adultos/Instituto Nacional para la Educación de los Adultos (FAETA/INEA)"]
[]
[]
[null,null,null,null,null,null,null,"Elige la Entidad Federativa…"]
[null,"Elige el Periodo…",null,null,null,null,null,"AGUASCALIENTES"]
[null,"1er. Trimestre",null,null,null,null,null,"BAJA CALIFORNIA"]
[null,"2do. Trimestre",null,null,null,null,null,"BAJA CALIFORNIA SUR"]
[null,"3er. Trimestre",null,null,null,null,null,"CAMPECHE"]
[null,"4to. Trimestre",null,null,null,null,null,"COAHUILA "]
[null,null,null,"Elige el Año…",null,null,null,"COLIMA "]
[null,null,null,2013,null,null,null,"CHIAPAS "]
[null,null,null,2014,null,null,null,"CHIHUAHUA "]
[null,null,null,2015,null,null,null,"DISTRITO FEDERAL"]
[null,null,null,2016,null,null,null," DURANGO "]
[null,null,null,2017,null,null,null," GUANAJUATO "]
[null,null,null,2018,null,null,null," GUERRERO "]
[null,null,null,null,null,null,null," HIDALGO"]
[null,null,null,null,null,null,null," JALISCO "]
[null,null,null,null,null,null,null," MEXICO "]
[null,null,null,null,null,null,null," MICHOACAN "]
[null,null,null,null,null,null,null," MORELOS "]
[null,null,null,null,null,null,null," NAYARIT "]
[null,null,null,null,null,null,null," NUEVO LEON"]
[null,null,null,null,null,null,null," OAXACA "]
[null,null,null,null,null,null,null," PUEBLA "]
[null,null,null,null,null,null,null," QUERETARO "]
[null,null,null,null,null,null,null," QUINTANA ROO"]
[null,null,null,null,null,null,null," SAN LUIS"]
[null,null,null,null,null,null,null," SINALOA "]
[null,null,null,null,null,null,null," SONORA "]
[null,null,null,null,null,null,null," TABASCO "]
[null,null,null,null,null,null,null," TAMAULIPAS "]
[null,null,null,null,null,null,null," TLAXCALA "]
[null,null,null,null,null,null,null," VERACRUZ"]
[null,null,null,null,null,null,null," YUCATÁN "]
[null,null,null,null,null,null,null," ZACATECAS "]